agrontology
type: Vocabulary
type: Ontology
modified: 2022-02-28T11:40:42Z
class number: 3
dataset: agrovoc
dataset: biotechglossary
property number: 168
imports: terms
imports: skos-xl

Is process for
type: ObjectProperty
comment: Y <es un proceso para> X. Una o varias acciones, actividades, métodos X que producen un cambio o desarrollo Y. Ej. "Esterilización (reproducción)" <es un proceso para> "Liberación de insectos estériles", "Fermentación alcohólica" <es un proceso para> "Vinificación". @es
comment: Y <est un processus pour> X. Une ou plusieurs actions, activités, méthodes Y qui produisent un changement ou un développement pour X. Par exemple, "stérilisation" <est un processus pour> "lâcher d'insectes stériles", "fermentation alcoolique" <est un processus pour> "vinification". @fr
comment: Y <is process for> X. One or more actions, activities, methods Y that produce a change or development for X. E.g. ”sterilization” <is process for> “sterile insect release”, “alcoholic fermentation” <is process for> “winemaking”.
comment: Y <вляется процессом для> X. Одно или несколько действий, мероприятий, методов Y, которые приводят к изменению или развитию для X. Например, ”стерилизация” <вляется процессом для> “выпуск стерильных насекомых”, “спиртовое брожение” <вляется процессом для> “виноделие”. @ru
comment: Y<是…的过程>X。一个或多个行动、活动、方法Y造成X的变化或发展。例如：“绝育” <是…的过程>“不孕昆虫释放”，“酒精发酵” <是…的过程>“酿酒”。 @zh
comment: ع <هي عملية لـ> س. إجراء واحد أو أكثر ،أنشطة أو طرق من ع تنتج تغييرًا أو تطويرًا لـ س. على سبيل المثال ”تعقيم” هي العملية لـ“إطلاق حشرة معقمة", "تخمير كحولي” هي العملية لـ “إعداد الخمور”. @ar
label: Es un proceso para @es
label: Est un processus pour @fr
label: вляется процессом для @ru
label: هي العملية ل @ar
label: 是…的过程 @zh
sub property of: Has goal or process
inverse of: Uses process

Uses process
type: ObjectProperty
comment: X <utiliza el proceso> Y. Una o varias acciones, actividades, métodos X que producen un cambio o desarrollo Y. Ej. "Cultivos de invierno" <utiliza el proceso> "Vernalización", “Envasado” <utiliza el proceso> "Esterilización”. @es
comment: X <uses process> Y. X uses one or more actions, activities, methods Y as a process. E.g. “winter crops” <uses process> “vernalization”, “canning” <uses process> “sterilizing”.
comment: X <utilise le processus> Y. X utilise une ou plusieurs actions, activités, méthodes Y comme processus. Par exemple, "culture d'hiver" <utilise le processus> "vernalisation", “mise en conserve” <utilise le processus> "stérilisation (germes)”. @fr
comment: X <использует процесс> Y. X использует одно или несколько действий, мероприятий, методов Y в качестве процесса. Например, “озимые культуры” <использует процесс> “яровизация”, “консервирование в герметичной таре” <использует процесс> “обеззараживание”. @ru
comment: X<使用过程>Y。X使用一个或多个行动、活动、方法Y作为其过程。例如：“越冬作物”<使用过程>“春化”，“罐藏”<使用过程>“灭菌”。 @zh
comment: س <يستخدم العملية> ع. يستخدم س واحدًا أو أكثر من الإجراءات والأنشطة والطرق للعملية ع. على سبيل المثال “محاصيل شتوية” <تستخدم عملية> “التنشيط بالبرد“, “التعليب” <يستخدم عملية> “التعقيم”. @ar
label: Utilise le processus @fr
label: Utiliza el proceso @es
label: использует процесс @ru
label: يستخدم العملية @ar
label: 使用过程 @zh
sub property of: Is achieved by means of
inverse of: Is process for

Has goal or process
type: ObjectProperty
comment: X <a le but ou le processus> Y. X a un objectif ou un processus prévu Y. Par exemple: "service vétérinaire" <a le but ou le processus> "santé animale", "coupe de rajeunissement" <a le but ou le processus> "régénération naturelle". @fr
comment: X <has goal or process> Y. X has intended goal or process Y. E.g. “veterinary services” <has goal or process> “animal health”, “coppicing” <has goal or process> “natural regeneration”.
comment: X <tiene el objetivo o el proceso> Y. Ej. "Servicios veterinarios" <tiene el objetivo o el proceso> "Sanidad animal", "Corta de renuevos" <tiene el objetivo o el proceso> "Regeneración natural". @es
comment: X <имеет цель или процесс> Y. X имеет намеченную цель или процесс Y. Например, "ветеринарные услуги" <имеет цель или процесс> "здоровье животных", "рубки обновления" <имеет цель или процесс> "естественное возобновление". @ru
comment: X<有目标或过程>Y。X有预期的目标或过程Y。例如：“兽医服务”<有目标或过程>“家畜健康”，“矮林作业”<有目标或过程>“天然更新”。 @zh
comment: س <لديه هدف أو عملية > ع.يحتوي س على الهدف المقصود أو العملية ع. على سبيل المثال "الخدمات البيطرية" <هدفها> "صحة الحيوان" . @ar
label: A le but ou le processus @fr
label: Tiene el objetivo o el proceso @es
label: имеет цель или процесс @ru
label: لديه الهدف @ar
label: 有目标或过程 @zh
sub property of: Process relationships
inverse of: Is achieved by means of

Is a trade name of
type: ObjectProperty
sub property of: Has synonym
inverse of: Has trade name, has commercial name

Has trade name, has commercial name
type: ObjectProperty
sub property of: Has synonym
inverse of: Is a trade name of

Has synonym
type: ObjectProperty
type: SymmetricProperty
comment: X <a le synonyme> Y. Y <a le synonyme> X .“Bulgarie” <a le synonyme> ”République de Bulgarie”. Utilisé pour distinguer un synonyme exact et actuel des termes obsolètes qui auraient pu être utilisés dans le passé (pour cela, utiliser <a nom ancien>). @fr
comment: X <has synonym> Y. Y <has synonym> X. “Bulgaria”<has synonym>”Republic of Bulgaria”. Used to distinguish an exact and current synonym from obsolete terms which might have been used in the past (for that, use <has old name>). Use only between labels for the same concept in a specific language.
comment: X <tiene sinónimo> Y. Y <tiene sinónimo> X. "Bulgaria" <tiene sinónimo> "República de Bulgaria". Se utiliza para distinguir un sinónimo exacto y actual de los términos obsoletos que pudieran haberse utilizado en el pasado (para ello, utilice <tiene nombre antiguo>). Se utiliza sólo entre etiquetas para el mismo concepto en un idioma específico. @es
comment: X <имеет синоним> Y. Y <имеет синоним> X. "Болгария" <имеет синоним> "Республика Болгария". Используется, чтобы отличить точный и актуальный синоним от устаревших терминов, которые могли использоваться в прошлом (для этого используйте hasOldName). Используется только между обозначениями одного и того же понятия на определенном языке. @ru
comment: X<有同义词>Y。Y<有同义词>X。“保加利亚”<有同义词>“保加利亚共和国”。 用于区分准确的、目前的同义词和过去的、可能使用过的过时的术语（对于后者，使用<有曾用名>）。限用于同一概念某一特定语言的不同标签。 @zh
comment: س <له المرادف> ع. ع <له المرادف> س على سبيل المثال: "بلغاريا" <لها المرادف> "جمهورية بلغاريا" يستخدم لتمييز المرادف الدقيق والحالي عن المصطلحات القديمة التي ربما تم استخدامها في الماضي (لذلك ، استخدم <له اسم قديم>). استخدم فقط بين التسميات لنفس المفهوم بلغة معينة @ar
domain: Label
label: A le synonyme @fr
label: Tiene sinónimo @es
label: химеет синоним @ru
label: له مرادف @ar
label: 有同义词 @zh
range: Label
sub property of: labelRelation

Measures
type: ObjectProperty
comment: Y <measures> X. Y is used to measure a quantitative property of X. For example: “thermometers” <measures> “temperature”, “social indicators” <measures> ”social change”.
comment: Y <medidas> X. Y se utiliza para medir una propiedad cuantitativa de X. Ej. “Termómetros” <medidas> “Temperatura”, “Indicadores sociales” <medidas> ”Cambio social”. @es
comment: Y <mesure> X. Y est utilisé pour mesurer une propriété quantitative de X. Par exemple, "thermomètre" <mesure> "température", "indicateur social" <mesure> "changement social". @fr
comment: Y <измеряет> X. Y используется для измерения количественного свойства X. Например: "термометры" <измеряет> "температура", "социальные показатели" <измеряет> "социальные изменения". @ru
comment: Y<测量>X。Y用于测量X数量方面的属性。例如：“体温计”<测量>“温度”，“社会指标”<测量>“社会变迁”。 @zh
comment: ع <يقيس> س.يتم استخدام ع لقياس خاصية الكمية لـ س. على سبيل المثال: " ميزان الحرارة" <يقيس> "درجة الحرارة" "المؤشرات الاجتماعية " <تقيس> " التغير الاجتماعي" @ar
label: Medidas @es
label: Mesure @fr
label: измеряет @ru
label: س يقيس ص @ar
label: 测量 @zh
sub property of: Quantitative relationship
inverse of: Is measured by

Is measured by
type: ObjectProperty
comment: X <est mesuré par> Y. Une propriété quantitative de X est mesurée par Y. Par exemple : "température" <est mesuré par> "thermomètre", "changement social" <est mesuré par> "indicateur social". @fr
comment: X <is measured by> Y. A quantitative property of X is measured by Y. For example: “temperature” <is measured by> “thermometers”, “social change” <is measured by> “social indicators".
comment: X <si mide mediante> Y. Una propiedad cuantitativa de X se mide con Y. Ej. “Temperatura” <si mide mediante> “Termómetros”, “Cambio social” <si mide mediante> "Indicadores sociales". @es
comment: X <измеряется чем> Y. Количественное свойство X измеряется Y. Например, "температура" <измеряется чем> "термометры", "социальные изменения" <измеряется чем> "социальные показатели". @ru
comment: X<由...测量>Y。X数量方面的属性由Y测量。例如：“温度”<由...测量>“体温计”，“社会变迁”<由...测量>“社会指标”。 @zh
comment: س <تُقاس من قبل> ع. يتم قياس خاصية الكمية لـ س بواسطة ع على سبيل المثال: "الحرارة" <تُقاس من قبل> "ميزان الحرارة" التغير الاجتماعي <يُقاس من قبل> " المؤشرات الاجتماعية" @ar
label: Est mesuré par @fr
label: Si mide mediante @es
label: измеряется чем @ru
label: يتم قياس x بواسطة y @ar
label: 由...测量 @zh
sub property of: Quantitative relationship
inverse of: Measures

Quantitative relationship
type: ObjectProperty
type: SymmetricProperty
comment: Super-property for quantitative relationships. All relationships involving a quantity or a measure.
comment: Super-propriété pour les relations quantitatives Toutes les relations impliquant une quantité ou une mesure. @fr
comment: Superpropiedad para las relaciones cuantitativas. Todas las relaciones que implican una cantidad o una medida. @es
comment: Сверхсвойство для количественных отношений. Все отношения, связанные с количеством или мерой. @ru
comment: خاصية فائقة للعلاقات الكمية. كل العلاقات التي تتضمن كمية أو مقياس. @ar
comment: 所有数量关系的父类属性 @zh
domain: Concept
label: Relaciones cuantitativas @es
label: Relations quantitatives @fr
label: количественные отношения @ru
label: العلاقات الكمية @ar
label: 数量关系 @zh
range: Concept
sub property of: related

Has pathogen
type: ObjectProperty
comment: X <a l'agent pathogène> Y. L'organisme X a un agent pathogène Y. Les agents pathogènes sont des microorganismes pathogènes tels que : des virus, des bactéries et des champignons. Par exemple, "Olea europaea" <a l'agent pathogène> "Xylella fastidiosa". @fr
comment: X <has pathogen> Y. Organism X has pathogen Y. Pathogens are pathogenic microorganism such as viruses, bacteria and fungi. E.g. "Olea europaea" <has pathogen> "Xylella fastidiosa".
comment: X <tiene patógeno> Y. El organismo X tiene el patógeno Y. Los patógenos son microorganismos patógenos como virus, bacterias y hongos. Ej. "Olea europaea" <tiene patógeno> "Xylella fastidiosa". @es
comment: X <имеет патоген> Y. Организм X имеет патоген Y. Патогены - это патогенные микроорганизмы, такие как вирусы, бактерии и грибы. Например, "Olea europaea" <имеет патоген> "Xylella fastidiosa". @ru
comment: X<有病原体>Y。生物体X有病原体Y。病原体指病毒、细菌和真菌等致病性微生物。例如：“Olea europaea”<有病原体>“Xylella fastidiosa”。 @zh
comment: س <لديه مسببات مرض> ع. الكائن الحي لديه مسببات مرض ع. مسببات الأمراض هي الكائنات الحية الدقيقة المسببة للأمراض مثل الفيروسات والبكتيريا والفطريات على سبيل المثال: "Olea europaea "<لديها مسببات مرض>" Xylella fastidiosa " @ar
label: A l'agent pathogène @fr
label: Tiene patógeno @es
label: имеет патоген @ru
label: لديه مسببات الأمراض @ar
label: 有病原体 @zh
sub property of: Causative relationship
inverse of: Is pathogen of

Is pathogen of
type: ObjectProperty
comment: Y <es patógeno de> X . Y es un patógeno del organismo X. Ej. "Xylella fastidiosa" <es patógeno de> "Olea europaea". @es
comment: Y <est pathogène de> X. Y est l'agent pathogène de l'organisme X. Par exemple, "Xylella fastidiosa" <est pathogène de> "Olea europaea". @fr
comment: Y <is pathogen of> X . Y is pathogen of organism X. E.g. "Xylella fastidiosa" <is pathogen of> "Olea europaea".
comment: Y <является патогеном> X .Y является патогеном организма X. Например, "Xylella fastidiosa" <является патогеном> "Olea europaea". @ru
comment: Y<是...的病原体>X。Y是生物体X的病原体。例如：“Xylella fastidiosa”<是...的病原体>“Olea europaea”。 @zh
comment: ع <هوالعامل الممرض لـ > س. ع هو العامل الممرض للكائن الحي س. على سبيل المثال: " Xylella fastidiosa " هو <العامل الممرض لـ > "Olea europaea " @ar
label: Es patógeno de @es
label: Est pathogène de @fr
label: является патогеном @ru
label: هو أحد مسببات الأمراض @ar
label: 是...的病原体 @zh
sub property of: Causative relationship
inverse of: Has pathogen

Causative relationship
type: ObjectProperty
type: SymmetricProperty
comment: Super-property for causative relationships
comment: Super-propriété pour les relations causales @fr
comment: Superpropiedad de las relaciones causales @es
comment: Сверхсвойство для причинно-следственных связей @ru
comment: خاصية فائقة للعلاقات السببية @ar
comment: 所有引起关系的父类属性 @zh
domain: Concept
label: Relaciones causales @es
label: Relations causales @fr
label: причинно-следственная связь @ru
label: العلاقات السببية @ar
label: 引起关系 @zh
range: Concept
sub property of: related

Is propagation process of
type: ObjectProperty
sub property of: Causative relationship
inverse of: Has Propagation process

Has Propagation process
type: ObjectProperty
sub property of: Causative relationship
inverse of: Is propagation process of

Is used in
type: ObjectProperty
comment: X <es utilizado en> Y. X se usa habitualmente en Y, es normal usar X en la práctica de Y. Ej. "Tripa" <es utilizado en> "Salchicha", "Trenes" <es utilizado en> "Transporte por ferrocarriles". @es
comment: X <est utilisé dans> Y. X est habituellement utilisé dans Y, il est normal d'utiliser X dans la pratique de Y. Par exemple, "boyau" <est utilisé dans> "saucisse", "train" <est utilisé dans> "transport ferroviaire". @fr
comment: X <is used in> Y. X is habitually used in Y, it is normal to use X in the practice of Y. E.g. “casings” <is used in> “sausages”, “trains” <is used in> “rail transport”.
comment: X <используется в> Y. X привычно используется в Y, нормально использовать X в практике Y. Например, "кишки" <используется в> "колбасные изделия", "Поезда" <используется в> "железнодорожные перевозки". @ru
comment: X<被用于>Y。 X习惯性地被用于Y中，在做法Y中通常使用X。例如：“肠衣”<被用于>“香肠”，“火车”<被用于>“铁路运输”。 @zh
comment: س <يستخدم في> ع. يتم استخدام س عادة في ع ، ومن الطبيعي استخدام س في ممارسة ع على سبيل المثال: "الأغلفة" تستخدم في "النقانق" "القطارات" تستخدم في "النقل بالسكك الحديدية" @ar
label: Es utilizado en @es
label: Est utilisé dans @fr
label: используется в @ru
label: يستخدم في @ar
label: 被用于 @zh
sub property of: Process relationships
inverse of: Make use of

Make use of
type: ObjectProperty
comment: Y <fait usage de> X. L'activité Y utilise le processus ou l'intrant X. Par exemple, "navigation" <fait usage de> "aide à la navigation", "agriculture de précision" <fait usage de> "système d'information géographique", "transport ferroviaire" <fait usage de> "train". @fr
comment: Y <hace uso de> X. La actividad Y utiliza el proceso o la entrada X. Ej. "Navegación" <hace uso de> "Ayuda a la navegación", "Agricultura de precisión" <hace uso de> "Sistemas de información geográfica", "Transporte por ferrocarrilese" <hace uso de> "Trenes". @es
comment: Y <make use of> X. Activity Y makes use of process or input X. E.g. “navigation” <make use of> ”navigational aids”, “precision agriculture” <make use of> ”geographical information systems”, “rail transport” <make use of> “trains”.
comment: Y <использует> X. Действие Y использует процесс или вход X. Например, "навигация" <использует> "навигационное оборудование", "точное сельское хозяйство" <использует> "географические информационные системы", "железнодорожные перевозки" <использует> "Поезда". @ru
comment: Y<利用>X。活动Y使用过程或投入物X。例如：“航海”<利用>“导航设备”，“精准农业”<利用>“地理信息系统”，“铁路运输”<利用>“火车”。 @zh
comment: ع <يستفد من> س. يستفيدالنشاط ع من العملية أو الإدخال س. على سبيل المثال "لملاحة" <تستفيد من> "المساعدات الملاحية"، "الزراعة الدقيقة " <تستفيد من> "نظم المعلومات الجغرافية". "النقل بالسكك الحديدية" <تستفيد من> " القطارات" @ar
label: Fait usage de @fr
label: Hace uso de @es
label: использует @ru
label: يستفاد من @ar
label: 利用 @zh
sub property of: Process relationships
inverse of: Is used in

Is achieved by means of
type: ObjectProperty
comment: Y <est réalisée au moyen de>X. Y est un objectif ou un processus utilisé par X, sans que Y fasse nécessairement partie de X. Par exemple : "confusion sexuelle" <est réalisée au moyen de> "analogue phéromone", "prise de décision" <est réalisée au moyen de> "système d'aide à la décision". @fr
comment: Y <is achieved by means of> X. Y is an objective or process used by X, without Y necessarily being part of X. E.g. “mating disruption” <is achieved by means of> “pheromone analogues”, “decision making” <is achieved by means of> “decision support systems”.
comment: Y <se consigue por medio de> X. Y es un objetivo o proceso utilizado por X, sin que Y sea necesariamente parte de X. Ej. “Confusión sexual” <se consigue por medio de> “Feromonas sintéticas”, “Toma de decisiones” <se consigue por medio de> “Sistemas de apoyo a las decisiones”. @es
comment: Y <достигается с помощью> X. Y это цель или процесс, используемый X, при этом Y не обязательно является частью X. Например, "нарушение спаривания" <достигается с помощью> "аналоги феромонов", "принятие решений" <достигается с помощью> "системы поддержки принятия решений". @ru
comment: Y<通过…手段实现>X。Y是X的目标或是X使用的过程，不一定是X的一部分。例如：“交配干扰”<通过…手段实现>“信息素类似物”，“决策”<通过…手段实现>“决策支持系统”。 @zh
comment: ع <يتم تحقيقه عن طريق> س . ع هو هدف أو عملية يستخدمها س ، دون أن يكون ع بالضرورة جزءاً من س. على سبيل المثال اضطراب التزاوج "<يتحقق عن طريق>" نظائر الفرمون " ، "إتخاذ القرار" <يتم تحقيقه عن طريق> "نظام دعم القرار". @ar
label: Est réalisée au moyen de @fr
label: Se consigue por medio de @es
label: достигается с помощью @ru
label: يتم تحقيقه عن طريق @ar
label: 通过…手段实现 @zh
sub property of: Process relationships
inverse of: Has goal or process

Is a local name of
type: ObjectProperty
sub property of: Has synonym
inverse of: Has local name

Has local name
type: ObjectProperty
sub property of: Has synonym
inverse of: Is a local name of

Is infected part of
type: ObjectProperty
sub property of: Causative relationship
inverse of: Has infection part

Has infection part
type: ObjectProperty
sub property of: Causative relationship
inverse of: Is infected part of

Is subprocess of
type: ObjectProperty
comment: Y <isSubprocessOf> X. Y is one of one or more processes naturally or conventionally associated with the realization of process X. E.g. "pasteurization" <isSubprocessOf> "milk production";
sub property of: Is included in
inverse of: Includes subprocess

Is included in
type: ObjectProperty
comment: X <est inclus dans> Y. X est une entité qui inclut l'élément Y. Par exemple, "écornage" <est inclus dans> "méthode d'élevage", "analyse microbiologique" <est inclus dans> "analyse de l'eau". @fr
comment: Y <incluido en>X. X es una entidad que incluye el elemento Y. Ej. "Descorne" <incluido en> "Métodos de crianza", "Análisis microbiológico" <incluido en> "Análisis de agua". @es
comment: Y <is included in>X. X is an entity that includes the element Y. For example: "dehorning” <included in> ”animal husbandry methods”, “microbiological analysis" <included in> “water analysis”
comment: Y <включен в> X. X - это сущность, которая включает элемент Y. Например, "удаление рогов" <включен в> "методы выращивания и содержания животных", "микробиологический анализ" <включен в> "анализ воды". @ru
comment: Y<包含于>X。实体X包含元素Y。例如：“断角术”<包含于>“家畜饲养方法”，“微生物分析”<包含于>“水分析”。 @zh
comment: ع <متضمن في> س. س هو كيان يتضمن العنصر ع على سبيل المثال: "عملية إزالة القرون" <متضمنة في>"طرق رعاية الحيوان" " تخصيص الموارد" <متضمنة في> "تحليل المياه" @ar
label: Est inclus dans @fr
label: Incluido en @es
label: входит в @ru
label: مدرج في @ar
label: 包含于 @zh
sub property of: Partitive relationship
inverse of: Includes

Includes subprocess
type: ObjectProperty
comment: X <includesSubprocess> Y. Process X naturally or conventionally realized at the minimum through process Y. Equivalent to <stageOf>. E.g. "milk production" <includesSubprocess> "pasteurization";
sub property of: Includes
inverse of: Is subprocess of

Is physiological function of
type: ObjectProperty
sub property of: Causative relationship
inverse of: Has physiological function

Has physiological function
type: ObjectProperty
sub property of: Causative relationship
inverse of: Is physiological function of

Surrounded by
type: ObjectProperty
comment: X <est entouré par> Y. L'objet X est physiquement entouré par l'objet Y. Par exemple, "pupe" <est entouré par> "cocon", "endosperme" <est entouré par> "cellule à aleurone". Utiliser uniquement pour les termes qui sont physiquement immédiatement adjacents à chacun autre. Pour la géographie, utilisez <est spatialement inclus dans>. @fr
comment: X <rodeado de> Y. El objeto X está físicamente rodeado por el objeto Y. Ej. “Pupa” <rodeado de> “Capullos“, "Endosperma” <rodeado de> “Células de aleurona". Utilizar sólo para los términos que son físicamente adyacentes entre sí. Para la geografía, utilice <se incluye espacialmente en>. @es
comment: X <surrounded by> Y. The object X is physically surrounded by object Y. E.g. “pupae” <surrounded by> “cocoons“, "endosperm” <surrounded by> “aleurone cells". Use only for the terms that are physically immediately adjacent to each other. For geography use <is spatially included in>.
comment: X <окружен> Y. Объект X физически окружен объектом Y. Например, "куколки" <окружен> "коконы", "эндосперм" <окружен> "алейроновые клетки". Используйте только для терминов, которые физически непосредственно примыкают друг к другу. Для географии используйте <пространственно включен в>. @ru
comment: X<被...围绕>Y。物体X在物理上被物体Y围绕。例如：“蛹”<被...围绕>“茧”，“胚乳”<被...围绕>“糊粉细胞”。仅可用于物理上彼此紧邻的术语。对于地理，使用<空间包含于>。 @zh
comment: س <مُحاط بـ > ع. الكائن س محاط فيزيائياً بالكائن ع. على سبيل المثال: "الخادرة" <محاطة بـ> "الشرانق" ، و "السويداء" <محاطة بـ> "خلايا ألورون". تستخدم فقط للمصطلحات المتاخمة فعلياً لبعضها البعض. للاستخدام الجغرافي <مدرج مكانيًا في>. @ar
label: Est entouré par @fr
label: Rodeado de @es
label: окружен @ru
label: وتحيط به @ar
label: 被...围绕 @zh
sub property of: Spatial relationship
inverse of: Surrounds

Surrounds
type: ObjectProperty
comment: Y <alrededor de> X. El objeto Y rodea físicamente al objeto X. Ej. ”Capullos" <alrededor de> “Pupa“, "Células de aleurona” <alrededor de> “Endosperma". Utilizar sólo para los términos que son físicamente adyacentes entre sí. Para la geografía, utilice <incluye espacialmente>. @es
comment: Y <entoure> X. L'objet Y entoure physiquement l'objet X. Par exemple,"cocon" <entoure> "pupe", "cellule à aleurone" <entoure> "endosperme". À utiliser uniquement pour les termes qui sont physiquement immédiatement adjacents les uns aux autres. Pour la géographie, utilisez <spatialement inclut>. @fr
comment: Y <surrounds> X. The object Y is physically surrounding object X. E.g. “cocoons” <surrounds> “pupae“, "aleurone cells” <surrounds> “endosperm". Use only for the terms that are physically immediately adjacent to each other. For geography use <spatially Includes>.
comment: Y <окружает> X. Объект Y физически окружает объект X. Например, "коконы" <окружает> "куколки", "алейроновые клетки" <окружает> "эндосперм". Используйте только для терминов, которые физически непосредственно примыкают друг к другу. Для географии используйте <пространственно включает>. @ru
comment: Y<围绕>X。物体Y在物理上围绕物体X。例如：“茧”<围绕>“蛹”，“糊粉细胞”<围绕>“胚乳”。仅可用于物理上彼此紧邻的术语。对于地理，使用<空间包含>。 @zh
comment: ع <يحيط بـ > س. الكائن ع يحيط فيزيائياً بالكائن س. على سبيل المثال: "الشرانق" <تحيط بـ> "الخادرة" ، و "خلايا ألورون" <تحيط بـ> "السويداء". تستخدم فقط للمصطلحات المتاخمة فعلياً لبعضها البعض. للاستخدام الجغرافي <يشمل مكانيًا>. @ar
label: Alrededor de @es
label: Entoure @fr
label: окружает @ru
label: يحيط @ar
label: 围绕 @zh
sub property of: Spatial relationship
inverse of: Surrounded by

Benefits from
type: ObjectProperty
comment: Y <benefitsFrom> X. A result Y that is advantageous to some beneficiary, produced by the behaviour of an agent X. A consequence Y achieved through a means X. E.g. "biological control" <benefitsFrom> "biological control arthropods"; "plant health" <benefitsFrom> "pest control";
sub property of: Causative relationship
inverse of: Is beneficial for

Is beneficial for
type: ObjectProperty
comment: X <isBeneficialFor> Y. Agent X behaves in a way that produces some result Y that is advantageous to some beneficiary. A means X through which a consequence Y can be achieved. E.g. "biological control arthropods" <isBeneficialFor> "biological control"; "pest control" <isBeneficialFor> "plant health";
sub property of: Causative relationship
inverse of: Benefits from

Has chemical formula
type: ObjectProperty
sub property of: labelRelation
inverse of: Is chemical formula of

Is chemical formula of
type: ObjectProperty
sub property of: labelRelation
inverse of: Has chemical formula

Has pest
type: ObjectProperty
comment: Y <a peste> X. Un organisme Y dans lequel le ravageur X cause des dommages. Les ravageurs sont des insectes, des nématodes et des rongeurs qui causent des dommages. Par exemple, "Apis mellifera" <a peste> "Varroa destructor", "Olea europaea" <a peste> "Bactrocera oleae". @fr
comment: Y <has pest> X. An organism Y in which the pest X causes harm. Pests are insects, nematodes and rodents that cause damage. E.g. "Apis mellifera" <has pest> "Varroa destructor", "Olea europaea" <has pest> "Bactrocera oleae".
comment: Y <tiene plaga> X. Un organismo Y en el que la plaga X causa daños. Las plagas son insectos, nematodos y roedores que causan daños. Ej. "Apis mellifera" <tiene plaga> "Varroa destructor", "Olea europaea" <tiene plaga> "Bactrocera oleae". @es
comment: Y есть вредитель X. Организм Y, которому вредитель X причиняет вред. Вредители - это насекомые, нематоды и грызуны, которые причиняют вред. Например, У "Apis mellifera" <есть вредитель> "Varroa destructor", У "Olea europaea" <есть вредитель> "Bactrocera oleae". @ru
comment: Y<有有害生物>X。有害生物X对生物体Y造成损害。有害生物指造成损害的昆虫、线虫和啮齿动物。例如：“西方蜜蜂”<有有害生物>“Varroa destructor”，“Olea europaea”<有有害生物>“油橄榄果实蝇”。 @zh
comment: ع <لديه الآفة> س. الكائن الحي ع الذي تسبب فيه الآفة س الضرر. الآفات هي الحشرات والديدان الخيطية والقوارض التي تسبب الضرر. على سبيل المثال: "Apis mellifera" < لديه الآفة> "Varroa destructor", "Olea europaea" <لديه الآفة> "Bactrocera oleae". @ar
label: A peste @fr
label: Tiene plaga @es
label: У ... есть вредитель ... @ru
label: لديه آفة @ar
label: 有有害生物 @zh
sub property of: Causative relationship
inverse of: Is a pest of

Is a pest of
type: ObjectProperty
comment: X <es una plaga de> Y. La plaga X causa daños al organismo Y. Ej. "Varroa destructor" <es una plaga de> "Apis mellifera". @es
comment: X <est peste de> Y. Le ravageur X cause des dommages à l'organisme Y. Les ravageurs sont des insectes, des nématodes et des rongeurs qui causent des dommages. Par ex. "Varroa destructor" <est peste de> "Apis mellifera". @fr
comment: X <pest of> Y. Pest X causes harm to organism Y. E.g. "Varroa destructor" <pest of> "Apis mellifera".
comment: X<是...的有害生物>Y。有害生物 X对生物体Y造成损害。例如：“Varroa destructor”<是...的有害生物>“西方蜜蜂”。 @zh
comment: Х вредитель Y. Вредитель Х наносит вред организму Y. Например, "Varroa destructor" <вредитель> "Apis mellifera". @ru
comment: س <هي آفة> ع. الآفة س تسبب ضرراً للكائن الحي ع. على سبيل المثال "Varroa destructor" <هي آفة> "Apis mellifera" @ar
label: Es una plaga de @es
label: Est peste de @fr
label: вредитель @ru
label: هي الآفة @ar
label: 是...的有害生物 @zh
sub property of: Causative relationship
inverse of: Has pest

Includes
type: ObjectProperty
comment: X <comprend> Y. X est une entité qui inclut l'élément Y. Par exemple, "méthode d'élevage" <comprend> "écornage", "analyse de l'eau" <comprend> "analyse microbiologique". @fr
comment: X <includes> Y. X is an entity that includes the element Y. For example: “animal husbandry methods” <includes> ”dehorning”, “water analysis” <includes> ”microbiological analysis”.
comment: X <incluye> Y. X es una entidad que incluye el elemento Y. Ej. "Métodos de crianza" <incluye> "Descorne", " Análisis de agua" <incluye> "Análisis microbiológico". @es
comment: X <включает> Y. X - это сущность, которая включает элемент Y. Например, "методы выращивания и содержания животных" <включает> "удаление рогов", "анализ воды" <включает> "микробиологический анализ". @ru
comment: X<包含>Y。实体X包含元素Y。例如：“家畜饲养方法”<包含>“断角术”，“水分析”<包含>“微生物分析”。 @zh
comment: س <يتضمن> ع. س هو كيان يتضمن العنصر ع على سبيل المثال: "طرق رعاية الحيوان" <تتضمن> "عملية إزالة القرون" "تحليل المياه" <تتضمن> " تخصيص الموارد" @ar
label: Comprend @fr
label: Incluye @es
label: включает @ru
label: يشمل @ar
label: 包含 @zh
sub property of: Partitive relationship
inverse of: Is included in

Has substitute
type: ObjectProperty
sub property of: related
inverse of: Is substitute for

Is substitute for
type: ObjectProperty
domain: Concept
sub property of: related
inverse of: Has substitute

Has practice
type: ObjectProperty
sub property of: Causative relationship
inverse of: Is practice for

Is practice for
type: ObjectProperty
sub property of: Causative relationship
inverse of: Has practice

Has parent
type: ObjectProperty
sub property of: related
inverse of: Is parent of

Is parent of
type: ObjectProperty
sub property of: related
inverse of: Has parent

Grows in
type: ObjectProperty
comment: X <growsIn> Y. A taxon X grows in an environment Y. Use this in a plant and related domain (e.g. fungi). E.g. "jasmine rice" <growsIn> "isarn region"; "rice" <growsIn> "moist soil";
sub property of: Causative relationship
inverse of: Is a growth environment for

Is a growth environment for
type: ObjectProperty
comment: Y <isAGrowthEnvironmentFor> X. An environment Y favorable to a taxon X. This is used as the inverse relationship of <growsIn>. Use this in a plant and related domain (e.g. fungi). E.g. "isarn region" <isAGrowthEnvironmentFor> "jasmine rice"; "moist soil" <isAGrowthEnvironmentFor> "rice";
sub property of: Causative relationship
inverse of: Grows in

Has symptom
type: ObjectProperty
comment: X <a symptôme> Y. Une maladie ou un désordre X présente une maladie caractéristique Y dans un organisme. Par exemple, "malnutrition" <a symptôme> "maigreur", "septicémie" <a symptôme> "choc septique". @fr
comment: X <has symptom> Y. A disease or disorder X presents disease characteristic Y in an organism. E.g. "malnutrition" <has symptom> "thinness", "septicaemia" <has symptom> "septic shock".
comment: X <tiene síntoma> Y. Una enfermedad o trastorno X presenta la característica de enfermedad Y en un organismo. Ej. "Malnutrición" <tiene síntoma> "Delgadez", "Septicemia" <tiene síntoma> "Shock séptico". @es
comment: X <имеет симптом> Y. Заболевание или расстройство X представляет характеристику болезни Y в организме. Например, "недостаточное питание" <имеет симптом> "худоба", "септицемия" <имеет симптом> "септический шок". @ru
comment: X<有症状>Y。疾病或病症X在生物体内显示出疾病特征Y。例如：“营养不良”<有症状>“体瘦”，“败血症”<有症状>“感染性休克”。 @zh
comment: س <لديه أعراض> ع. المرض او الاضطراب س يعرض سمة المرض ع في كائن حي. على سبيل المثال: "سوء التغذية" <لديها أعراض> "النحافة"، " التسمم الدموي" <لديه أعراض> " الصدمة الانتانية" @ar
domain: Concept
label: A symptôme @fr
label: Tiene síntoma @es
label: имеет симптом @ru
label: له أعراض @ar
label: 有症状 @zh
sub property of: Causative relationship
inverse of: Indicates

Indicates
type: ObjectProperty
comment: Y <indica> X. Una enfermedad o trastorno característico Y en un organismo indica enfermedad X. Ej. "Shock séptico" <indica> "Septicemia". Úselo solo para enfermedades. Pero, "Acidez" <si mide mediante> "pH". @es
comment: Y <indicates> X. A disease or disorder characteristic Y in an organism indicates disease X. E.g. "septic shock" <indicates> "septicaemia". Use only for diseases. However, "acidity" <is measured by> "pH".
comment: Y <indique> X. Une maladie ou un désordre caractéristique Y dans un organisme indique une maladie X. Par ex. "choc septique" <indique> "septicémie". Utiliser uniquement pour les maladies. Cependant, "acidité" <est mesuré par> "pH". @fr
comment: Y <показывает> X. Y <показывает> X. Характеристика болезни или расстройства Y в организме указывает на болезнь X. Например, "септицемия" <показывает> "септический шок". Используется только для болезней. Однако "кислотность" <измеряется> "pH". @ru
comment: Y<指示>X。生物体的疾病或病征Y指示疾病X。例如：“感染性休克”<指示>“败血症”。仅适用于疾病。但是，“酸性”<由...测量>“酸碱度”。 @zh
comment: ع <يشير إلى> س. المرض او الاضطراب ع في كائن حي يشير إلى المرض س على سبيل المثال: " الصدمة الانتانية <تشير إلى> " التسمم الدموي". تستخدم فقط للأمراض. ومع ذلك ، "الحموضة" <تقاس بـ> "درجة الحموضة" @ar
label: Indica @es
label: Indique @fr
label: показывает @ru
label: يُظهر @ar
label: 指示 @zh
sub property of: Causative relationship
inverse of: Has symptom

Is produced by
type: ObjectProperty
comment: X <es producido por> Y. Restringir el uso a los procesos naturales (como los frutos que crecen en las plantas, los huevos, la leche), pero también a los procesos químicos. Ej. “Miel” <es producido por> “Abeja melífera”, “Papa” <es producido por> “Solanum tuberosum". Pero, “Queso” <producto de> “Fabricación del queso”. @es
comment: X <est produit par> Y. Restreindre l'utilisation aux processus naturels (tels que les fruits poussant sur les plantes, les œufs, le lait) - mais aussi les processus chimiques. Par exemple, "miel" <est produit par> "abeille domestique", "pomme de terre" <est produit par> "Solanum tuberosum". Cependant, "fromage" <produit de> "fabrication du fromage". @fr
comment: X <is produced by> Y. Restrict use to natural processes (such as fruits growing on plants, eggs, milk) - but also chemical processes. E.g. “honey” <is produced by> “honey bees”, “potatoes” <is produced by> “Solanum tuberosum". However, “cheese” <product of> “cheese-making”.
comment: X <производится> Y. Ограничьте использование естественными процессами (такими как плоды, растущие на растениях, яйца, молоко) - но также и химическими процессами. Например, "мед" <производится> "медоносные пчелы", "картофель (клубни)" <производится> "Solanum tuberosum". Однако "сыры" <является продуктом> "сыроделие". @ru
comment: X<由...生产>Y。限用于自然过程（如长在植物上的水果，蛋类，牛奶），也可用于化学过程。例如：“蜂蜜”<由...生产>“蜜蜂”，“马铃薯”<由...生产>“阳芋”。但是，“干酪”<是...的产品>“奶酪制作”。 @zh
comment: س <يُنتج من قبل> ع. تقييد الاستخدام للعمليات الطبيعية (مثل الفاكهة التي تنمو على النباتات والبيض والحليب) - ولكن أيضًا العمليات الكيميائية على سبيل المثال: "العسل" <يُنتج من قبل> "نحل العسل" البطاطا <يُنتج من قبل> "Solanum tuberosum" ومع ذلك ، "الجبن" <هو نتاج> "صناعة الجبن". @ar
label: Es producido por @es
label: Est produit par @fr
label: производится @ru
label: من إنتاج @ar
label: 由...生产 @zh
sub property of: Causative relationship
inverse of: Produces

Produces
type: ObjectProperty
comment: Y <produce> X. E.g. “Abeja melífera” <produce> “Miel”, “Solanum tuberosum” <produce> "Papa". Pero “Fabricación del queso” <tiene el producto> ”Queso”. @es
comment: Y <produces> X. E.g. “honey bees” <produces>“honey”, “Solanum tuberosum” <produces> "potatoes". However, “cheese-making” <has product>”cheese”.
comment: Y <produit> X. Ex. "abeille domestique" <produit> "miel", “Solanum tuberosum” <produit> "pomme de terre". Cependant, "fabrication fromagère" <a le produit> "fromage". @fr
comment: Y <производит> X. Например, "медоносные пчелы" <производит> "мед", "Solanum tuberosum" <производит> "картофель (клубни)". Однако "сыроделие" <имеет продукт> "сыры". @ru
comment: Y<生产>X。例如：“蜜蜂”<生产>“蜂蜜”，“阳芋”<生产>“马铃薯”。但是，“奶酪制作”<有产品>“干酪”。 @zh
comment: ع <ينتج> س. . على سبيل المثال: "نحل العسل" <ينتج> "العسل"، "Solanum tuberosum"<تنتج> "البطاطا". ومع ذلك ، فإن "صناعة الجبن" <لها منتج> "جبن". @ar
label: Produce @es
label: Produit @fr
label: производит @ru
label: ينتج عنه @ar
label: 生产 @zh
sub property of: Causative relationship
inverse of: Is produced by

Has biological control agent
type: ObjectProperty
sub property of: Causative relationship
inverse of: Is biological control agent of

Is biological control agent of
type: ObjectProperty
sub property of: Causative relationship
inverse of: Has biological control agent

Is performed by means of
type: ObjectProperty
comment: Y <isPerformedByMeansOf> X. An object or process X mainly used to perform a process Y. See also <usedAs>. E.g. "curry paste grinding" <isPerformedByMeansOf> "curry paste grinding machine"; "weapon" <meansFor> "killing"; "fishing pole" <meansFor> "fishing"; "alcohol" <meansFor> "cleaning"; but NOT "knives" <meansFor> "felling" (because knives are not primarily used for cutting down trees);
sub property of: Process relationships
inverse of: Is means for

Is means for
type: ObjectProperty
comment: X <isMeansFor> Y. An object or process X mainly used to perform a process Y. See also <usedAs>. E.g. "curry paste grinding" <performedWithInstrument> "curry paste grinding machine"; "weapon" <instrumentFor> "killing"; "fishing pole" <instrumentFor> "fishing"; "alcohol" <instrumentFor> "cleaning"; Ploughs <isMeansFor> Ploughing ;but NOT "knives" <instrumentFor> "felling" (because knives are not primarily used for cutting down trees);
sub property of: Process relationships
inverse of: Is performed by means of

Is symbol for
type: ObjectProperty
comment: Y <es símbolo de> X. "Fe (símbolo)" <es símbolo de> "Hierro". Se utiliza para desambiguar los símbolos de elementos químicos de otras abreviaturas similares. @es
comment: Y <est le symbole de> X. "Fe (symbole)" <est le symbole de> "fer". À utiliser pour lever l'ambiguïté des symboles d'éléments chimiques à partir d'autres abréviations similaires. @fr
comment: Y <is symbol for> X. ”Fe (symbol)” <is symbol for> “iron”. Use for disambiguation of chemical element symbols from other similar abbreviations.
comment: Y <символ для> X. "Fe" <символ для> "железо". Используется для разотождествления символов химических элементов от других подобных сокращений. @ru
comment: Y<是...的符号>X。“Fe(元素)”<是...的符号>“铁”。用于化学元素符号与其他类似缩写的消歧。 @zh
comment: ع <هي الرمز الكيميائي لـ> س. على سبيل المثال: " Fe" <هي الرمز الكيميائي لـ> "الحديد" يستخدم لتوضيح رموز العناصر الكيميائية من الاختصارات المشابهة الأخرى. @ar
label: Es símbolo de @es
label: Est le symbole de @fr
label: символ для @ru
label: هو رمز كيميائي لـ @ar
label: 是...的符号 @zh
sub property of: Has synonym
inverse of: Has symbol

Has symbol
type: ObjectProperty
comment: X <a le symbole> Y. "fer" <a le symbole> "Fe (symbole)". À utiliser pour lever l'ambiguïté des symboles d'éléments chimiques à partir d'autres abréviations similaires. @fr
comment: X <has symbol> Y. “iron” has symbol ”Fe (symbol)”. Use for disambiguation of chemical element symbols from other similar abbreviations.
comment: X <tiene símbolo> Y. "Hierro" <tiene símbolo> "Fe (símbolo)". Se utiliza para desambiguar los símbolos de elementos químicos de otras abreviaturas similares. @es
comment: X <имеет символ> Y. "железо" имеет символ "Fe". Используется для разотождествления символов химических элементов от других подобных сокращений. @ru
comment: X<有符号>Y。“铁”<有符号>“Fe(元素)”。用于化学元素符号与其他类似缩写的消歧。 @zh
comment: س <لها الرمز الكيميائي> ع. على سبيل المثال: " الحديد" <لها الرمز الكيميائي> "Fe" يستخدم لتوضيح رموز العناصر الكيميائية من الاختصارات المشابهة الأخرى. @ar
label: A le symbole @fr
label: Tiene símbolo @es
label: имеет символ @ru
label: لها الرمز الكيميائي @ar
label: 有符号 @zh
sub property of: Has synonym
inverse of: Is symbol for

Controls
type: ObjectProperty
sub property of: Causative relationship
inverse of: Is controlled by

Is controlled by
type: ObjectProperty
sub property of: Causative relationship
inverse of: Controls

Has control method
type: ObjectProperty
sub property of: Causative relationship
inverse of: Is control method of

Is control method of
type: ObjectProperty
sub property of: Causative relationship
inverse of: Has control method

Has property
type: ObjectProperty
comment: X <a la propriété> Y. Une propriété peut être une qualité ou un trait. Par exemple, "semence" <a la propriété> "grosseur des semences", "plante médicinale" <a la propriété> "propriété pharmacologique". @fr
comment: X <has property> Y. A property might be a quality or trait. E.g. “seed” <has property> “seed size", “medicinal plants” <has property> “medicinal properties”.
comment: X <tiene propriedad> Y. Una propiedad puede ser una cualidad o un rasgo. Ej. “Semillas” <tiene propriedad> “Tamaño de la semilla", “Plantas medicinales” <tiene propriedad> “Propiedades medicinales”. @es
comment: X <обладает свойством> Y. Свойство может быть качеством или признаком. Например, "семенной материал" <обладает свойством> "крупность семян", "лекарственные растения" <обладает свойством> "фармакологические свойства". @ru
comment: X<有属性>Y。属性可以是一种性质或特点。例如：“种子”<有属性>“种子大小”和“种子活力”，“药用植物类” <有属性>“药物属性”。 @zh
comment: س <لديه خاصية> ع. الخاصية قد تكون جودة أو ميزة. على سبيل المثال: البذرة"<لديها خاصية> "حجم البذرة" "النباتات الطبية" <لديها خاصية> "الخصائص الطبية" @ar
label: A la propriété @fr
label: Tiene propriedad @es
label: обладает свойством @ru
label: لديه ممتلكات @ar
label: 有属性 @zh
sub property of: Causative relationship
inverse of: Is property of

Is property of
type: ObjectProperty
comment: Y <es propriedad de> X. Una propiedad puede ser una cualidad o un rasgo. Ej. “Viabilidad de la semilla” <es propriedad de> “Semillas”, “Propiedades medicinales” <es propriedad de> “Plantas medicinales”. @es
comment: Y <est une propriété de> X. Une propriété peut être une qualité ou un trait. Par exemple, "viabilité des semences" <est une propriété de> "semence", "propriété pharmacologique" <est une propriété de> "plante médicinale". @fr
comment: Y <is property of> X. A property might be a quality or trait. E.g. “seed viability” <is property of> “seed”, “medicinal properties” <is property of> “medicinal plants”.
comment: Y <является свойством> X. Свойство может быть качеством или признаком. Например, "жизнеспособность семян" <является свойством> "семенной материал", "фармакологические свойства" <является свойством> "лекарственные растения". @ru
comment: Y<是...的属性>X。属性可以是一种性质或特点。例如：“种子活力”<是...的属性>“种子”，“药物属性”<是...的属性>“药用植物类”。 @zh
comment: ع <هي خاصية لـ> س. الخاصية قد تكون جودة أو ميزة. على سبيل المثال: "صلاحية البذور" <هي خاصية لـ> "البذور" ، "الخصائص الطبية" <هي خاصية لـ> "النباتات الطبية". @ar
label: Es propriedad de @es
label: Est une propriété de @fr
label: является свойством @ru
label: هي ملكية لـ @ar
label: 是...的属性 @zh
sub property of: Causative relationship
inverse of: Has property

Is used as
type: ObjectProperty
comment: X <مستعمل ك> Y: "سربتول" <مستعمل ك> "محليات"; "إيثانول" <مستعمل ك> "وقود". @ar
comment: X <est utilisé comme> Y. Par exemple: "sorbitol" <est utilisé comme> "édulcorant"; "éthanol" <est utilisé comme> "combustible". @fr
comment: X <is used as> Y. E.g. "sorbitol" <is used as> "sweetener"; "ethanol" <is used as> "fuel".
comment: X <se utiliza como> Y. Ej. "Sorbitol" <se utiliza como> "Edulcorantes"; "Etánol" <se utiliza como> "Combustibles". @es
comment: X <используется как> Y. Например, "сорбитол" <используется как> "подсластители"; "этанол" <используется как> "топливо". @ru
comment: X <用作> Y. 例如 : "山梨醇" <用作> "甜味剂"; "乙醇" <用作> "燃料". @zh
label: Est utilisé comme @fr
label: Se utiliza como @es
label: используется как @ru
label: مستعمل ك @ar
label: 用作 @zh
sub property of: Process relationships
inverse of: Is use of

Is use of
type: ObjectProperty
comment: Y <es el uso de> X. Ej. "Edulcorantes" <es el uso de> '"Sorbitol", "Combustibles" <es el uso de> "Etánol". @es
comment: Y <est l'utilisation de> X. Par exemple: "édulcorant" <est l'utilisation de> "sorbitol", "combustible" <est l'utilisation de> "éthanol". @fr
comment: Y <is use of> X. For example, "sweeteners" <is use of> '"sorbitol", "fuels" <is use of> "ethanol".
comment: Y <это использование> X. Например, "подсластители" <это использование> "сорбитол", "топливо" <это использование> "этанол". @ru
comment: Y <هو استخدام> X: "محليات" <هو استخدام> '"سربتول" @ar
comment: Y <是使用> X. 例如 : "甜味剂" <是使用> '"山梨醇", "燃料" <是使用> "乙醇". @zh
label: Es el uso de @es
label: Est l'utilisation de @fr
label: это использование @ru
label: هو استخدام @ar
label: 是使用 @zh
sub property of: Process relationships
inverse of: Is used as

Is influenced by or Depends on
type: ObjectProperty
sub property of: Causative relationship
inverse of: Influences

Influences
type: ObjectProperty
sub property of: Causative relationship
inverse of: Is influenced by or Depends on

Is a transliteration of
type: ObjectProperty
sub property of: labelRelation
inverse of: Has transliteration

Has transliteration
type: ObjectProperty
domain: Label
sub property of: labelRelation
inverse of: Is a transliteration of

Has theme
type: ObjectProperty
comment: From CWR ontology.
sub property of: Causative relationship
inverse of: Is theme of

Is theme of
type: ObjectProperty
comment: From CWR ontology.
sub property of: Causative relationship
inverse of: Has theme

Is old name of
type: ObjectProperty
comment: Y <- старое название> X. Используется для устаревших обозначений, например, старых названий стран. Например, "Народная Республика Болгария" <- старое название> "Болгария". Использовать только для обозначения одного и того же понятия на определенном языке. @ru
comment: Y <es nombre antiguo de> X. Se utiliza para etiquetas obsoletas, como nombres antiguos de países. Por ejemplo, "República Popular de Bulgaria" <es nombre antiguo de> "Bulgaria". Usar sólo para etiquetas del mismo concepto en un idioma específico. @es
comment: Y <est nom ancien de> X. À utiliser pour les étiquettes obsolètes, comme les anciens noms de pays. Par exemple, "République populaire de Bulgarie" <est nom ancien de> "Bulgarie". Utilisez uniquement entre les termes pour le même concept dans une langue spécifique. @fr
comment: Y <is old name of> X. Use for obsolete labels , like old names of countries. E.g. “People’s Republic of Bulgaria” <is old name of> ”Bulgaria”. Use only for labels for the same concept in a specific language.
comment: Y<是...的曾用名>X。用于过时的标签，如国家的旧名。例如：“保加利亚人民共和国”<是...的曾用名>“保加利亚”。限用于同一概念某一特定语言的不同标签。 @zh
comment: ع <هي الاسم القديم لـ> س .يستخدم للتسميات القديمة ، مثل الأسماء القديمة للبلدان على سبيل المثال: "جمهورية بلغاريا الشعبية" <هي الاسم القديم لـ> "بلغاريا" تستخدم فقط بين التسميات لنفس المفهوم بلغة معينة. @ar
label: - старое название @ru
label: Es nombre antiguo de @es
label: Est nom ancien de @fr
label: هو الاسم القديم ل @ar
label: 是...的曾用名 @zh
sub property of: Has synonym
inverse of: Has old name

Has old name
type: ObjectProperty
comment: X <a nom ancien> Y. À utiliser pour les étiquettes obsolètes, comme les anciens noms de pays. Par exemple, “Bulgaria”<a nom ancien>”République populaire de Bulgarie”. Utilisez uniquement entre les termes pour le même concept dans une langue spécifique. @fr
comment: X <has old name> Y. Use for obsolete labels, such as old names of countries. E.g. “Bulgaria”<has old name>”People’s Republic of Bulgaria”. Use only between labels for the same concept in a specific language.
comment: X <tiene nombre antiguo> Y. Se utiliza para etiquetas obsoletas , como nombres antiguos de países. Por ejemplo, "Bulgaria" <tiene nombre antiguo> "República Popular de Bulgaria". Usar sólo entre etiquetas para el mismo concepto en un idioma específico. @es
comment: X <имеет старое название> Y. Используется для устаревших обозначений, например, старых названий стран. Например, "Болгария" <имеет старое название> "Народная Республика Болгария". Используется только между обозначениями для одного и того же понятия на определенном языке. @ru
comment: X<有曾用名>Y。用于过时的标签，如国家的旧名。例如：“保加利亚”<有曾用名>“保加利亚人民共和国”。限用于同一概念某一特定语言的不同标签。 @zh
comment: س <له الاسم القديم> ع. يستخدم للتسميات القديمة ، مثل الأسماء القديمة للبلدان على سبيل المثال: "بلغاريا" <لها الاسم القديم> "جمهورية بلغاريا الشعبية" تستخدم فقط بين التسميات لنفس المفهوم بلغة معينة. @ar
label: a nom ancien @fr
label: tiene nombre antiguo @es
label: имеет старое название @ru
label: له اسم قديم @ar
label: 有曾用名 @zh
sub property of: Has synonym
inverse of: Is old name of

Is composed of
type: ObjectProperty
comment: X <est composé de> Y. X est composé de la matière ou de la substance Y. Par exemple, "flore du sol" <est composé de"flore microbienne", "tuff" <est composé de> "matériau volcanique". @fr
comment: X <está compuesto de> Y. X está compuesto de materia o sustancia Y. Ej. "Flora del suelo" <está compuesto de> "Flora microbiana", "Toba" <está compuesto de> "Materiales volcánicos". @es
comment: X <is composed of> Y. X is composed of material or substance Y . E.g. “soil flora” <is composed of> “microbial flora”, “tuff”<is composed of> “volcanic materials”.
comment: X <состоит из> Y. X состоит из материала или вещества Y. Например, "почвенная флора" <состоит из> "микробная флора", "туф (вулканический)" <состоит из> "вулканогенные материалы". @ru
comment: X<由...组成>Y。X由材料或物质Y组成。例如：“土壤植物区系”<由...组成>“微生物菌群”，“凝灰岩”<由...组成>“火山灰物质”。 @zh
comment: س <يتكون من> ع. يتكون س من المادة أو الأداة ع. على سبيل المثال: "نباتات التربة" <تتكون من > "نباتات جرثومية" " صخر tuff"<يتكون من> "مواد بركانية". @ar
label: Est composé de @fr
label: Está compuesto de @es
label: состоит из @ru
label: يتكون من @ar
label: 由...组成 @zh
sub property of: Has part
inverse of: Compose

Has part
type: ObjectProperty
comment: X <a partie> Y. Une entité composite X qui peut être identifiée comme composée d'une ou plusieurs parties, entre lesquelles Y. Par exemple, "tige" <a partie> "cortex", "racine" <a partie> "nodosité racinaire". Utilisez cette relation lorsqu'aucune des autres relations partitives inférieures (<a le composant>, <est composé de>, <membre de>) ne s'applique. @fr
comment: X <has part> Y. A composite entity X that can be identified as being composed of one or more parts, between which Y. E.g. “stems” <has part> “cortex”, “roots” <has part>“root nodules”. Use this relationship when none of the other lower partitive relations (<has component>, <is composed of>, <member>) apply.
comment: X <tiene parte> Y. Una entidad compuesta X que puede ser identificada como compuesta por una o más partes, entre las cuales Y. Por ejemplo, "Tallos" <tiene parte> "Cortex", "Raíces" <tiene parte> "Nudosidades radiculares". Utilice esta relación cuando ninguna de las otras relaciones partitivas inferiores (<tiene componente>, <está compuesto de>, <miembro>) sea aplicable. @es
comment: X <имеет часть> Y. Составная сущность X, которая может быть идентифицирована как состоящая из одной или более частей, между которыми Y. Например, "стебли" <имеет часть> "кортекс", "корни" <имеет часть> "корневые клубеньки". Используйте это отношение, когда ни одно из других низших партитивных отношений (<имеет компонент>, <состоит из>, <является членом>) не применимо. @ru
comment: X<有部分>Y。复合实体X可被认定为由一个或多个部分组成，其中包括Y。例如：“茎”<有部分>“皮层”，“根”<有部分>“根节结”。用于其他下位整体部分关系（<有组成部分>，<是...的组成部分>，<是...的成员>）都不适用时。 @zh
comment: س <له جزء> ع. الكيان المركب س يمكن تحديده على أنه مكون من جزء واحد أو أكثر ، بينها ع. على سبيل المثال: "الساق" <لها جزء>" القشرة" "الجذور" <لها جزء> "عقد الجذور". استخدم هذه العلاقة عندما لا تنطبق أي من العلاقات الجزئية السفلية الأخرى (<لها مكون> ، <مكون من> ، <عضو>). @ar
label: A partie @fr
label: Tiene parte @es
label: имеет часть @ru
label: لديه جزء @ar
label: 有部分 @zh
sub property of: Partitive relationship
inverse of: Is part of

Compose
type: ObjectProperty
comment: Y - это то, из чего сделан X. Y - это материал или вещество, из которого состоит X. Например, "микробная флора" - это то, из чего сделан "почвенная флора", "вулканогенные материалы" - это то, из чего сделан "туф (вулканический)". @ru
comment: Y <compone> X. Y es el material o sustancia de la que se compone X. Ej. Par exemple, "Flora microbiana" <compone> "Flora del suelo", "Materiales volcánicos" <compone> "Toba". @es
comment: Y <compose> X. Y est le matériau ou la substance dont X est composé. Par exemple, "flore microbienne" <compose> "flore du sol", "matériau volcanique" <compose> "tuff". @fr
comment: Y <compose> X. Y is the material or substance of which X is composed. E.g. “microbial flora” <compose> "soil flora", “volcanic materials” <compose> "tuff".
comment: Y<组成>X。Y是组成X的材料或物质。例如：“微生物菌群”<组成>“土壤植物区系”，“火山灰物质”<组成>“凝灰岩”。 @zh
comment: ع <يؤلف> س. ع هي الأداة أو المادة التي تتكون منها س. على سبيل المثال: "النباتات الجرثومية" <تؤلف > "نباتات التربة" "مواد بركانية" <تؤلف> " صخر tuff" @ar
label: ... - это то, из чего сделан ... @ru
label: Compone @es
label: تتكون Y من @ar
label: 组成 @zh
sub property of: Is part of
inverse of: Is composed of

Is caused by
type: ObjectProperty
comment: Y <est causée par> X. Un résultat Y s'est produit à cause d'un agent X (animé ou inanimé). Par exemple, "encéphalopathie spongiforme" <est causée par> "prion", "fanaison" <est causée par> "déficit d'humidité du sol". @fr
comment: Y <está causado por> X. Un resultado Y se produjo debido a un agente X (animado o inanimado). Ej. "Encefalopatía espongiforme" <está causado por> "Prione", "Marchitamiento" <está causado por> "Déficit de humedad en el suelo". @es
comment: Y <is caused by> X. A result Y occurred because of an agent X (animate or inanimate). E.g. "spongiform encephalopathy" <is caused by> “prions”, "soil moisture deficit” <is caused by> "wilting".
comment: Y <вызвано> X. Результат Y произошел из-за агента X (одушевленного или неодушевленного). Например, "губчатая энцефалопатия" <вызвано> "прионы", "увядание" <вызвано> "дефицит влажности почвы". @ru
comment: Y<由...引起>X。结果Y由于媒介X（生物或非生物）而发生。例如：“海绵状脑病”<由...引起>“朊病毒”，“萎蔫”<由...引起>“土壤水分亏缺”。 @zh
comment: ع <سببه> س. النتيجة ع تحدث بسبب العامل س (الحي أو غير الحي) على سبيل المثال: "الاعتلال الدماغي الاسفنجي" <سببه> "البريونات" الذبول" <سببه> "النقص في رطوبة التربة" @ar
label: Est causée par @fr
label: Está causado por @es
label: вызвано @ru
label: هو سبب @ar
label: 由...引起 @zh
sub property of: Causative relationship
inverse of: Causes

Causes
type: ObjectProperty
comment: X <causa> Y. El agente X (animado o inanimado) provoca un resultado Y. Ej. "Priones" <causa> "Encefalopatía espongiforme", "Déficit de humedad en el suelo" <causa> "Marchitamiento". @es
comment: X <cause> Y. L'agent X (animé ou inanimé) produit un résultat Y. Par exemple, "prion" <cause> "encéphalopathie spongiforme", "déficit d'humidité du sol" <cause> "fanaison". @fr
comment: X <causes> Y. Agent X (animate or inanimate) brings about a result Y. E.g. "prions" <causes> "spongiform encephalopathy", "soil moisture deficit" <causes> "wilting".
comment: X <причины > Y. Агент X (одушевленный или неодушевленный) приводит к результату Y. Например, "прионы" <причины> "губкообразная энцефалопатия", "водный дефицит в почве" <причины> "увядание". @ru
comment: X<引起>Y。媒介X（生物或非生物）引起结果Y。例如：“朊病毒”<引起>“海绵状脑病”，“土壤水分亏缺”<引起>“萎蔫”。 @zh
comment: س <يسبب> ع. العامل س (حي أو غير حي) يحقق نتيجة ع. على سبيل المثال: "البريونات" <تسبب> "الاعتلال الدماغي الاسفنجي" "نقص في رطوبة التربة" <يسبب> "الذبول" @ar
label: Causa @es
label: Cause @fr
label: причины @ru
label: الأسباب @ar
label: 引起关系 @zh
sub property of: Causative relationship
inverse of: Is caused by

Is object of activity
type: ObjectProperty
comment: X<是活动...的对象>Y。概念X是活动Y关注的对象。例如：“羊毛”<是活动...的对象>“剪毛”，“条约”<是活动...的对象>“批准”。 @zh
comment: Y <es objeto de la actividad> X. La actividad Y tiene como foco el concepto X. Ej. “Lana” <es objeto de la actividad> "Esquileo”, “Tratados" <es objeto de la actividad> “Ratificación”. @es
comment: Y <est l'objet de l'activité> X. Y est le centre de l'activité X. Par exemple, “laine" <est l'objet de l'activité> "tonte", “traité” <est l'objet de l'activité> “ratification”. @fr
comment: Y <is object of activity> X. Y is the focus of activity X. E.g. “wool” <is object of activity> "shearing”, “treaties" <is object of activity> “ratification”.
comment: Y <является объектом деятельности> X. Y является центром деятельности X. Например, "шерсть" <является объектом деятельности> "стрижка", "пакты" <является объектом деятельности> "ратификация". @ru
comment: ع <هو هدف النشاط> س . ع هو محور النشاط س. على سبيل المثال "الصوف" <هو محور> "الجز" ، "المعاهدات" <هي محور > "التصديق". @ar
label: Es objeto de la actividad @es
label: Est l'objet de l'activité @fr
label: является объектом деятельности @ru
label: هو محور النشاط @ar
label: 是活动...的对象 @zh
sub property of: Causative relationship
inverse of: Has object of activity

Has object of activity
type: ObjectProperty
comment: X <a objet d'activité> Y. Le concept X est au centre de l'activité Y. "tonte" <a objet d'activité> "laine", "ratification" <a objet d'activité> "traité". @fr
comment: X <has object of activity> Y. Activity X focuses on Y. E.g. “shearing” <has object of activity> “wool”, “ratification” <has object of activity> “treaties”.
comment: X <tiene objeto de la actividad> Y. El concepto X es el foco de la actividad Y.Ej. “Esquileo” <tiene objeto de la actividad> “Lana”, “Ratificación” <tiene objeto de la actividad> “Tratados”. @es
comment: X <имеет объект деятельности> Y. Действие X сосредоточено на Y. Например, "стрижка" имеет объект деятельности> "шерсть", "ратификация" <имеет объект деятельности> "пакты". @ru
comment: X <有活动对象> Y。活动X关注对象Y。例如：“剪毛”<有活动对象>“羊毛”，“批准”<有活动对象>“条约”。 @zh
comment: س <له هدف النشاط> ع. يركز النشاط س على ع. على سبيل المثال "الجز" <له هدف> "الصوف" ، "التصديق" <له هدف> "المعاهدات". @ar
label: A objet d'activité @fr
label: Tiene objeto de la actividad @es
label: имеет объект деятельности @ru
label: له هدف النشاط @ar
label: 有活动对象 @zh
sub property of: Process relationships
inverse of: Is object of activity

Performs
type: ObjectProperty
sub property of: Causative relationship
inverse of: Is performed by

Is performed by
type: ObjectProperty
sub property of: Causative relationship
inverse of: Performs

Is croping system of
type: ObjectProperty
sub property of: Causative relationship
inverse of: Has croping system

Has croping system
type: ObjectProperty
sub property of: Causative relationship
inverse of: Is croping system of

Is afflicted by
type: ObjectProperty
comment: Y <est affligé par> X. La santé ou le bien-être d'un organisme ou d'une partie du corps Y pourrait être affecté par la maladie ou le désordre X. Par exemple, "abeille domestique" <est affligé par> "varroase", "langue" <est affligé par> "glossite". @fr
comment: Y <está afligido por> X. La salud o el bienestar de un organismo o parte del cuerpo Y podría verse afectado negativamente por la enfermedad X. Ej. "Abeja melífera" <está afligido por> "Varroosis", "Lengua" <está afligido por> "Glositis". @es
comment: Y <is afflicted by> X. The health or wellbeing of an organism or body part Y could adversely be affected by the disease X. E.g. "honey bees" <is afflicted by> "varoosis", "tongue" <is afflicted by> "glossitis".
comment: Y негативно влияет болезнь X. На здоровье или благополучие организма или части тела Y может негативно повлиять болезнь X. Например, на "медоносные пчелы" негативно влияет болезнь "варроато", на "язык" негативно влияет болезнь "глоссит". @ru
comment: Y<受...损伤>X。生物体或身体部分Y的健康可能受到疾病X的负面影响。例如：“蜜蜂”<受...损伤>“蜂螨病”，“舌”<受...损伤>“舌炎”。 @zh
comment: ع < يصاب بـ > س. يمكن أن تتأثر صحة أو رفاهية كائن حي أو جزء من الجسم ع سلبًا بالمرض س. " على سبيل المثال "نحل العسل" <يصاب بـ > "امرض الفاروا" ، "اللسان" <يصاب بـ> "التهاب اللسان". @ar
label: est affligé par @fr
label: está afligido por @es
label: на ... негативно влияет болезнь ..... @ru
label: تتأثر ... بـ ... @ar
label: 受...损伤 @zh
sub property of: Is affected by
inverse of: Afflicts

Afflicts
type: ObjectProperty
comment: X <afflicts> Y. The disease or disorder X could have negative effects in Y, such as adversely affect the health of an organism or body part Y. E.g. "scrapie" <afflicts> "sheep", “glossitis” <afflicts> “tongue”.
comment: X <afflige> Y. La maladie ou le désordre X pourrait avoir des effets négatifs sur Y, tels que nuire à la santé d'un organisme ou d'une partie du corps Y. Par exemple, "tremblante" <afflige> "mouton", "glossite" <afflige> "langue". @fr
comment: X <aflige> Y. La enfermedad o el trastorno X podría tener efectos negativos en Y, como por ejemplo, afectar negativamente a la salud de un organismo o una parte del cuerpo Y. Ej. "Scrapie" <aflige> "Ovinos", “Glositis” <aflige> “Lengua”. @es
comment: X <поражает> Y. Болезнь или расстройство X может иметь негативные последствия для Y, например, отрицательно повлиять на здоровье организма или части тела Y. Например, "скрейпи" <поражает> "овцы", "глоссит" <поражает> "язык". @ru
comment: X<损伤>Y。疾病或病症X可能对Y造成负面影响，如对生物体或身体部分Y的健康造成不利影响。例如：“羊瘙痒病”<损伤>“绵羊”，“舌炎”<损伤>“舌”。 @zh
comment: س < يصيب > ع. يمكن أن يكون للمرض أو الاضطراب س آثار سلبية في ع. مثل التأثير سلبًا على صحة كائن حي أو جزء من الجسم ع على سبيل المثال "مرض سكرابي" <يصيب> "الخروف" ، "التهاب اللسان" <يصيب> "اللسان". @ar
label: Afflige @fr
label: Aflige @es
label: поражает @ru
label: لهجمات @ar
label: 损伤 @zh
sub property of: Affects
inverse of: Is afflicted by

Is affected by
type: ObjectProperty
comment: Y <est affecté par> X. Un objet Y change d'état ou de localisation suite à l'action d'un agent X. Par exemple, "arbre" <est affecté par> "arboricide", "aptitude au transport" <est affecté par> "dégât mécanique". Ne l'utilisez pas pour des maladies ou des désordres: pour ceux-là, utilisez <afflige/est affligé par>. @fr
comment: Y <está afectado por> X. Un objeto Y cambia de estado o ubicación debido a la acción de un agente X. Ej. "Árboles" <está afectado por> "Arboricidas", "Aptitud para el transporte" <está afectado por> "Daños mecánicos". No lo utilice para enfermedades o trastornos; para ellos, utilice <aflige/está afligido por>. @es
comment: Y <is affected by> X. An object Y changes state or location because of an action of an agent X. E.g. "trees" <is affected by> "arboricides", "transporting quality" <is affected by> "mechanical damage". Do not use for diseases or disorders; for those, use <afflicts/is afflicted by>.
comment: Y<受...影响> X。对象Y的状态或位置由于媒介X的行为而发生变化。例如：“树”<受...影响>“树木毒杀剂”，“运输性能”<受...影响>“机械损伤”。 请勿用于疾病或病症；对于疾病和病症，使用<损伤/受...损伤>。 @zh
comment: на Y влияет X. Объект Y изменяет состояние или местоположение из-за действия агента X. Например, на "деревья" влияет "арборициды", на "качество транспортировки" влияет "механические повреждения". Не используйте для болезней или расстройств; для них используйте <поражает/на ... негативно влияет болезнь .....>. @ru
comment: ع <يتأثر بـ >س . يغير الكائن "ع" حالته أو موقعه بسبب إجراء قام به العامل "س". على سبيل المثال. "الأشجار" تتأثر بـ "مبيدات الشجر" ، "جودة النقل" تتأثر "بالضرر الميكانيكي". لا تستخدم للأمراض أو الاضطرابات. لهؤلاء استخدم <afflicts / isAfflictedBy>. @ar
label: Est affecté par @fr
label: Está afectado por @es
label: на ... влияет .... @ru
label: يتأثر بها @ar
label: 受...影响 @zh
sub property of: Causative relationship
inverse of: Affects

Is composition of
type: ObjectProperty
sub property of: Partitive relationship
inverse of: Has composition

Has composition
type: ObjectProperty
sub property of: Partitive relationship
inverse of: Is composition of

Has broader synonym
type: ObjectProperty
domain: Label
range: Label
sub property of: Has synonym
inverse of: Has narrower synonym

Has narrower synonym
type: ObjectProperty
domain: Label
range: Label
sub property of: Has synonym
inverse of: Has broader synonym

Study
type: ObjectProperty
comment: Y <estudia> X. El campo, la ciencia o el grupo Y estudia el concepto X. Ej. “Sedimentología” <estudia> “Sedimento”, “Anatomía de la madera” <estudia> “Duramen”. @es
comment: Y <study> X. Field, science or group Y studies concept X. E.g. “sedimentology” <study> “sediment”, “wood anatomy” <study> “heartwood”.
comment: Y <étude> X. Domaine, science ou groupe Y étude concept X. Par exemple, "sédimentologie" <étude> "sédiment", "anatomie du bois" <étude> "bois de coeur". @fr
comment: Y <изучает> X. Область, наука или группа Y изучает концепцию X. Например, "седиментология" <изучает> "осадок", "строение древесины" <изучает> "ядровая древесина". @ru
comment: Y<研究>X。领域、科学或组群Y研究X。例如：“沉积学”<研究>“沉积物”，“木材解剖学”<研究>“心材”。 @zh
comment: ع<تدرس>س. العلم أو المجموعة ع تدرس المفهوم س. على سبيل المثال "علم الرواسب" <تدرس>"الرواسب" ، "تشريح الخشب" <تدرس> "قلب الخشب". @ar
domain: Concept
label: Estudia @es
label: Étude @fr
label: изучает @ru
label: دراسات @ar
label: 研究 @zh
range: Concept
sub property of: Process relationships
inverse of: Is studied by

Is studied by
type: ObjectProperty
comment: X <es estudiado por > Y. El concepto X es estudiado por el campo, la ciencia o el grupo Y. Ej. “Paleontología” <es estudiado por> "Paleontólogos”, “Condiciones de trabajo” <es estudiado por> “Ergonomía”. @es
comment: X <est étudié par> Y. Le concept X est étudié par domaine, science ou groupe Y. Par exemple, "paléontologie" <est étudié par> "paléontologue", "condition de travail" <est étudié par> "ergonomie". @fr
comment: X <is studied by> Y. Concept X is studied by field, science or group Y. E.g. “palaeontology”<is studied by> "palaeontologists”, “working conditions” <is studied by> “ergonomics”.
comment: X <изучается> Y. Понятие X изучается областью, наукой или группой Y. Например, "палеонтология" <изучается> "палеонтологи", "условия труда" <изучается> "эргономика". @ru
comment: X<被...研究>Y。概念X是领域、科学或组群Y的研究对象。例如：“古生物学”<被...研究>“古生物学家”，“工作条件”<被...研究>“人机工程学”。 @zh
comment: س <تُدرس من قبل> ع. يتم دراسة المفهوم س حسب المجال أو العلم أو المجموعة ع. على سبيل المثال "علم الحفريات" <تمت دراسته من قبل> "علماء الحفريات" "ظروف العمل" <تمت دراستها من قبل>" بيئة العمل @ar
label: <изучается> @ru
label: Es estudiado por @es
label: Est étudié par @fr
label: تدرس من قبل @ar
label: 被...研究 @zh
sub property of: Process relationships
inverse of: Study

Follows
type: ObjectProperty
domain: Concept
range: Concept
sub property of: Temporal relations
inverse of: precedes

Temporal relations
type: ObjectProperty
type: SymmetricProperty
domain: Concept
range: Concept
sub property of: related

Is part of
type: ObjectProperty
comment: Y <es parte de> X. X está compuesto por una o más partes, donde Y es una parte. Ej. "Cortex" <es parte de> "Tallos", "Nudosidades radiculares" <es parte de> "Raíces". Utilice esta relación cuando no se aplique ninguna de las otras relaciones partitivas inferiores (<está compuesto de>, <tiene miembro>). @es
comment: Y <is part of> X. X is composed of one or more parts, where Y is one part. E.g. “cortex” <is part of> “stems”, “root nodules” <is part of> “roots". Use this relationship when none of the other lower partitive relations (<is composed of>, <has member>) apply.
comment: Y <является частью> X. X состоит из одной или нескольких частей, где Y - одна часть. Например, "кортекс" <является частью> "стебли", "корневые узелки" <является частью> "корни". Используйте это отношение, когда ни одно из других низших партитивных отношений (<состоит из>, <hasMember>) не применимо. @ru
comment: Y<是...的部分>X。X由一个或多个部分组成，其中包括Y。例如：“皮层”<是...的部分>“茎”，“根节结”<是...的部分>“根”。 用于其他下位整体部分关系（<有组成部分>，<是...的组成部分>，<有成员>）都不适用时。 @zh
comment: Y <fait partie de> X. X est composé d'une ou plusieurs parties, où Y est une partie. Par exemple, "cortex" <fait partie de> "tige", "nodosité racinaire" <fait partie de> "racine". Utilisez cette relation lorsqu'aucune des autres relations de partition inférieure (<est composé de>, <a un membre>) ne s'applique. @fr
comment: ع <هو جزء من> س. يتكون س من جزء واحد أو أكثر ، حيث ع جزء واحد. على سبيل المثال: "القشرة" <هي جزء من> "الساق" "عقد الجذور" <هي جزء من> "الجذور" استخدم هذه العلاقة عندما لا تنطبق أي من العلاقات الجزئية السفلية الأخرى ( <مكون من>، <لديه عضو> ) @ar
label: Es parte de @es
label: Fait partie de @fr
label: является частью @ru
label: وهو جزء من @ar
label: 是...的部分 @zh
sub property of: Partitive relationship
inverse of: Has part

Is component of
type: ObjectProperty
comment: X <is component of> Y. An object X that is a part of a whole Y, also has an existence independently from Y. E.g. "leaves" <is component of> "trees", "engines" <is component of> "vehicle systems".
comment: X<是...的组成部分>Y。物体X是整体Y的一部分，同时也独立于Y存在。例如：“叶”<是...的组成部分>“树”，“发动机”<是...的组成部分>“车辆系统”。 @zh
comment: X <es componente de> Y. Un objeto X que forma parte de un conjunto Y, también tiene una existencia independiente de Y. Ej. "Hojas" <es componente de> "Árboles", "Motores" <es componente de> "Componentes del vehículo". @es
comment: X <est un composant de> Y. Un objet X qui fait partie d'un Y entier, a également une existence indépendante de Y. Par exemple, "feuille" <est un composant de> "arbre", "moteur" <est un composant de> "organe de véhicule" . @fr
comment: X <является компонентом> Y. Объект X, который является частью целого Y, также имеет существование независимо от Y. Например, "листья" <является компонентом> "деревья", "двигатели" <является компонентом> "системы машин". @ru
comment: س <هي مكون من> ع. الكائن س هو جزء من ع بالكامل وله أيضاً وجود مستقل عن ع. على سبيل المثال: "الورقة" <هي مكون من > "الشجرة" " المحركات" <هي مكون من > "منظومات المركبات". @ar
label: Es componente de @es
label: Est un composant de @fr
label: является компонентом @ru
label: هو مكون من @ar
label: 是...的组成部分 @zh
sub property of: Is part of
inverse of: Has component

Has component
type: ObjectProperty
comment: Y <a le composant> X. Un objet X qui fait partie d'un Y entier et a également une existence indépendamment de Y. Par exemple, "arbre" <a le composant> "feuille", "organe de véhicule" <a le composant> "moteur". @fr
comment: Y <has component> X. An object X that is a part of a whole Y and also has an existence independently from Y. E.g. "trees" <has component> "leaves", "vehicle systems" <has component> "engines".
comment: Y <tiene componente> X. Un objeto X que es una parte de un todo Y y tiene también una existencia independiente de Y. Ex. Par exemple, "Árboles" <tiene componente> "Hojas", "Componentes del vehículo" <tiene componente> "Motores". @es
comment: Y <имеет компонент> X. Объект X, который является частью целого Y и также имеет существование независимо от Y. Например, "деревья" <имеет компонент "листья", "системы машин" <имеет компонент> "двигатели". @ru
comment: Y<有组成部分>X。物体X是整体Y的一部分，同时也独立于Y存在。例如：“树”<有组成部分>“叶”，“车辆系统”<有组成部分>“发动机”。 @zh
comment: س <يحتوي على> ع. الكائن س هو جزء من ع بالكامل وله أيضاً وجود مستقل عن ع. على سبيل المثال: "الأشجار" <تحتوي على > "الأوراق" " منظومات المركبات" <تحتوي على > "المحركات". @ar
label: A le composant @fr
label: Tiene componente @es
label: имеет компонент @ru
label: مكون @ar
label: 有组成部分 @zh
sub property of: Has part
inverse of: Is component of

Is cultivation process of
type: ObjectProperty
sub property of: Process relationships
inverse of: Has cultivation process

Has cultivation process
type: ObjectProperty
sub property of: Process relationships
inverse of: Is cultivation process of

Scientific name of
type: ObjectProperty
comment: Y <- научное название>X. Например, "Salmo trutta" <- научное название> "морская форель". Связь между метками для использования внутри концепции. Используется, когда общее название и научное название не являются отдельными понятиями, или когда отдельное отношение между научным и общим названием необходимо для конкретного языка. Если общее название и научное название являются отдельными понятиями, используйте отношение концепт-концепт <имеет таксономическую концепцию/имеет концепцию общего названия>. @ru
comment: Y <es el nombre científico de> X. Ej."Salmo trutta" <es el nombre científico de> "Trucha de mar". Relación de etiqueta a etiqueta para su uso dentro de un concepto. Se utiliza cuando el nombre común y el nombre científico no son conceptos separados, o cuando se necesita una relación separada entre el nombre científico y el nombre común para un idioma específico. Cuando el nombre común y el nombre científico son conceptos separados, utilice la relación de concepto a concepto <tiene concepto taxonómico/tiene nombre común del concepto>. @es
comment: Y <est le nom scientifique de> X. "Salmo trutta" <est le nom scientifique de> "truite de mer". Relation terme à terme à utiliser dans un concept. À utiliser lorsque le nom commun et le nom scientifique ne sont pas des concepts distincts, ou lorsqu'une relation distincte entre le nom scientifique et le nom commun est nécessaire pour un Lorsque le nom commun et le nom scientifique sont des concepts distincts, utilisez la relation de concept à concept <a concept taxonomique /a nom commun de concept>. @fr
comment: Y <scientific name of> X. E.g. “Salmo trutta” <scientific name of> "sea trout”. Label-to-label relationship for use within a concept. Use when common name and scientific name are not separate concepts, or when a separate relation between scientific and common name is needed for a specific language. When common name and scientific name are separate concepts, use concept-to-concept relation <has taxonomic concept/has common name concept>.
comment: Y<是...的学名>X。例如：“Salmo trutta”<是...的学名>“褐鳟”。可用于同一概念内的标签间关系。当俗名和学名不是独立的概念，或者当特定的语言需要在学名和俗名之间建立单独的关系时使用。当俗名和学名是独立的概念时，使用概念间关系<有分类学概念/有常用名概念>。 @zh
comment: ع <هي الاسم العلمي لـ> س. على سبيل المثال: "Salmo trutta” <هي الاسم العلمي لـ> "التروت البحري" علاقة التسمية إلى التسمية للاستخدام داخل المفهوم. يستخدم عندما لا يكون الاسم الشائع والاسم العلمي مفهومين منفصلين ، أو عندما تكون هناك حاجة لعلاقة منفصلة بين الاسم العلمي والاسم الشائع للغة معينة. عندما يكون الاسم الشائع والاسم العلمي مفهومين منفصلين ، استخدم علاقة المفهوم بالمفهوم <له مفهوم تصنيفي / له مفهوم اسم شائع>. @ar
label: - научное имя @ru
label: Es el nombre científico de @es
label: Est le nom scientifique de @fr
label: هو الاسم العلمي ل @ar
label: 是...的学名 @zh
sub property of: Has synonym
inverse of: Has scientific name

Has scientific name
type: ObjectProperty
comment: X <a nom scientifique> Y. Par exemple, "truite de mer" <a nom scientifique> "Salmo trutta". Relation concept à concept à utiliser dans un concept. À utiliser lorsque le nom commun et le nom scientifique ne sont pas des concepts distincts, ou lorsqu'une relation distincte entre le nom scientifique et le nom commun est nécessaire pour une langue spécifique. Lorsque le nom commun et le nom scientifique sont des concepts distincts, utilisez la relation de concept à concept <a concept taxonomique /a nom commun de concept>. @fr
comment: X <has scientific name> Y. E.g. “sea trout” <has scientific name> "Salmo trutta”. Label-to-label relationship for use within a concept. Use when common name and scientific name are not separate concepts, or when a separate relation between scientific and common name is needed for a specific language. When common name and scientific name are separate concepts, use concept-to-concept relation <has taxonomic concept/has common name concept>.
comment: X <tiene nombre científico> Y. Ej. "Trucha de mar" <tiene nombre científico> "Salmo trutta". Relación de etiqueta a etiqueta para su uso dentro de un concepto. Se utiliza cuando el nombre común y el nombre científico no son conceptos separados, o cuando se necesita una relación separada entre el nombre científico y el nombre común para un idioma específico. Cuando el nombre común y el nombre científico son conceptos separados, utilice la relación de concepto a concepto <tiene concepto taxonómico/tiene nombre común del concepto>. @es
comment: X <имеет научное название> Y. Например, "морская форель" <имеет научное название> "Salmo trutta". Отношения между метками для использования внутри концепции. Используется, когда общее название и научное название не являются отдельными понятиями, или когда отдельное отношение между научным и общим названием необходимо для конкретного языка. Когда общее название и научное название являются отдельными понятиями, используйте отношение концепт-концепт <имеет таксономическую концепцию/имеет концепцию общего названия>. @ru
comment: X<有学名>Y。例如：“褐鳟”<有学名>“Salmo trutta”。可用于同一概念内的标签间关系。当俗名和学名不是独立的概念，或者当特定的语言需要在学名和俗名之间建立单独的关系时使用。当俗名和学名是独立的概念时，使用概念间关系<有分类学概念/有常用名概念>。 @zh
comment: س <لها الاسم العلمي> ع. على سبيل المثال: "التروت البحري" <له الاسم العلمي> "Salmo trutta” علاقة التسمية إلى التسمية للاستخدام داخل المفهوم. يستخدم عندما لا يكون الاسم الشائع والاسم العلمي مفهومين منفصلين ، أو عندما تكون هناك حاجة لعلاقة منفصلة بين الاسم العلمي والاسم الشائع للغة معينة. عندما يكون الاسم الشائع والاسم العلمي مفهومين منفصلين ، استخدم علاقة المفهوم بالمفهوم <له مفهوم تصنيفي / له مفهوم اسم شائع>. @ar
label: A nom scientifique @fr
label: Tiene nombre científico @es
label: имеет научное название @ru
label: له اسم علمي @ar
label: 有学名 @zh
sub property of: Has synonym
inverse of: Scientific name of

Has acronym
type: ObjectProperty
comment: X <a l'acronyme> Y. Un acronyme est une abréviation formée des lettres initiales d'autres mots, souvent prononcées comme un mot. Par exemple, “syndrome d'immunodéficience acquise" <a l'acronyme>”sida (maladie)”. @fr
comment: X <has acronym> Y. An acronym is an abbreviation formed from the initial letters of other words, often pronounced as a word. E.g. “acquired immunodeficiency syndrome” <has acronym>”AIDS”.
comment: X <tiene acrónimo> Y. Un acrónimo es una abreviatura formada por las letras iniciales de otras palabras, a menudo pronunciadas como una palabra. Por ejemplo, "Síndrome de inmunodeficiencia adquirida" <tiene acrónimo> "SIDA". @es
comment: X <имеет акроним> Y. Акроним - это аббревиатура, образованная из начальных букв других слов, часто произносимых как одно слово. Например, "синдром приобретенного иммунодефицита" <имеет акроним> "спид". @ru
comment: X<有缩略语>Y。缩略语由其他单词首字母组成，通常读作一个词。例如：“获得性免疫缺陷综合征”<有缩略语>“艾滋病”。 @zh
comment: س <لها الاختصار> ع. الاختصار هو اختصار يتكون من الأحرف الأولى للكلمات الأخرى ، وغالبًا ما يتم نطقه ككلمة. على سبيل المثال: "متلازمة نقص المناعة المكتسبة" <لها الاختصار> "مرض الايدز". @ar
label: A l'acronyme @fr
label: Tiene acrónimo @es
label: имеет акроним @ru
label: له اختصار @ar
label: 有缩略语 @zh
sub property of: Has abbreviation
inverse of: Is acronym of

Is acronym of
type: ObjectProperty
comment: Y <es acrónimo de> X. Un acrónimo es una abreviatura formada por las letras iniciales de otras palabras, que a menudo se pronuncia como una palabra. "SIDA" <es acrónimo de> "Síndrome de inmunodeficiencia adquirida". @es
comment: Y <est l'acronyme de> X. Un acronyme est une abréviation formée des lettres initiales d'autres mots, souvent prononcées comme un mot. “UE” <est l'acronyme de> ”Union européenne”. @fr
comment: Y <is acronym of> X. An acronym is an abbreviation formed from the initial letters of other words, often pronounced as a word. “AIDS” <is acronym of>”acquired immunodeficiency syndrome”.
comment: Y <является акронимом> X. Акроним - это аббревиатура, образованная из начальных букв других слов, часто произносимая как слово. "спид" <является акронимом> "синдром приобретенного иммунодефицита". @ru
comment: Y<是...的缩略语>X。缩略语由其他单词首字母组成，通常读作一个词。“艾滋病”<是...的缩略语>“获得性免疫缺陷综合征”。 @zh
comment: ع <هي اختصار لـ> س. الاختصار هو اختصار يتكون من الأحرف الأولى للكلمات الأخرى ، وغالبًا ما يتم نطقه ككلمة. على سبيل المثال: "مرض الايدز" <هو اختصار لـ> "متلازمة نقص المناعة المكتسبة" @ar
label: Es acrónimo de @es
label: Est l'acronyme de @fr
label: является акронимом @ru
label: هو اختصار @ar
label: 是...的缩略语 @zh
sub property of: Is abbreviation of
inverse of: Has synonym

Has abbreviation
type: ObjectProperty
domain: Label
sub property of: Has synonym
inverse of: Is abbreviation of

Affects
type: ObjectProperty
comment: X <afecta> Y. La acción del agente X cambia el estado o la ubicación de Y. Ej. "Agotamiento del agua" <afecta> "Capa freática", "Daños mecánicos" <afecta> "Aptitud para el transporte". No lo utilice para enfermedades o trastornos; para ellos, utilice <aflige/está afligido por>. @es
comment: X <affecte> Y. L'agent X agit sur l'objet Y de telle sorte que Y change d'état ou de localisation. Par exemple, "tarissement" <affecte> "nappe souterraine", "dégât mécanique" <affecte> "aptitude au transport". Ne l'utilisez pas pour des maladies ou des désordres : pour ceux-là, utilisez <afflige/est affligé par>. @fr
comment: X <affects> Y. Action of agent X changes the state or location of Y. E.g. "water depletion" <affects> "groundwater table", "mechanical damage" <affects> “transporting quality”. Do not use for diseases or disorders; for those, use <afflicts/is afflicted by>.
comment: X <влияет на> Y. Действие агента X изменяет состояние или местоположение Y. Например, "истощение водных ресурсов" <влияет на> "уровень грунтовых вод", "механические повреждения" <влияют на> "пригодность к транспортировке". Не используйте для болезней или расстройств; для них используйте <поражает/на ... негативно влияет болезнь .....>. @ru
comment: X<影响> Y。媒介X的行为改变Y的状态或位置。例如：“水枯竭”<影响> “地下水位”，“机械损伤”<影响> “运输性能”。请勿用于疾病或病症；对于疾病和病症，使用<损害/受...损害>。 @zh
comment: س <يؤثر على> ع. أي إجراء من العامل س يؤدي إلى تغيير حالة أو موقع ع على سبيل المثال: "نضوب المياه" <يؤثر على> "منسوب المياه الجوفية" "الضرر الميكانيكي" <يؤثر على> "جودة النقل" لا تستخدم للأمراض أو الاضطرابات. لهؤلاء استخدم <afflicts / isAfflictedBy>. @ar
label: Afecta @es
label: Affecte @fr
label: влияет на @ru
label: يؤثر @ar
label: 影响 @zh
sub property of: Causative relationship
inverse of: Is affected by

Is disease for
type: ObjectProperty
comment: Y <es la enfermedad por> X. La enfermedad Y es enfermedad del organismo X. Ej. "Carbón suelto del sorgo” <es la enfermedad por> “Sorghum". Relación entre la enfermedad y el organismo. @es
comment: Y <est maladie de> X. La maladie Y est un maladie de l'organisme X. Par exemple, "charbon nu du sorgho" <est maladie de> "Sorghum". Relation entre la maladie et l'organisme. @fr
comment: Y <is disease for> X. Disease Y is disease of organism X. E.g. “loose smut of sorghum”<is disease for> “Sorghum". Disease to organism relationship.
comment: Y <является болезнью для> X. Болезнь Y является болезнью организма X. Например, "мелкопузырчатая головня сорго" <является болезнью для> "Sorghum". Отношения между болезнью и организмом. @ru
comment: Y<是...的疾病>X。疾病Y是生物体X的疾病。例如：“高粱散黑粉病”<是...的疾病>“高粱属”。疾病-生物体关系。 @zh
comment: ع هو <مرض> س. المرض ع هو مرض الكائن س. على سبيل المثال: "تفحم الذرة الرفيعة" هو <مرض> "الذرة". علاقة المرض بالكائن الحي. @ar
label: Es la enfermedad por @es
label: Est maladie de @fr
label: является болезнью для @ru
label: هو مرض @ar
label: 是...的疾病 @zh
sub property of: Causative relationship
inverse of: Has disease

Has disease
type: ObjectProperty
comment: X <a la maladie> Y. L'organisme X peut avoir la maladie Y. Par exemple, "Sorghum" <a la maladie> "charbon nu du sorgho" . Relation entre l'organisme et la maladie. @fr
comment: X <has disease> Y. Organism X can have disease Y. E.g. “Sorghum” <has disease> “loose smut of sorghum”. Organism to disease relationship.
comment: X <tiene la enfermedad> Y. El organismo X puede tener la enfermedad Y. Ej. "Sorghum” <tiene la enfermedad> “Carbón suelto del sorgo”. Relación organismo-enfermedad. @es
comment: X <имеет болезнь> Y. Организм X может иметь болезнь Y. Например, “Sorghum” <имеет болезнь> “мелкопузырчатая головня сорго”. Отношения между организмом и болезнью. @ru
comment: X<有疾病>Y。生物体X可能会有疾病Y。例如：“高粱属”<有疾病>“高粱散黑粉病”。生物体-疾病关系。 @zh
comment: س <لديه مرض> ع. يمكن أن يكون لدى الكائن س المرض ع. على سبيل المثال: "الذرة الرفيعة" <لديها مرض> "تفحم الذرة الرفيعة". علاقة الكائن الحي بالمرض. @ar
domain: Concept
label: A la maladie @fr
label: Tiene la enfermedad @es
label: имеет болезнь @ru
label: لديه مرض @ar
label: 有疾病 @zh
sub property of: Causative relationship
inverse of: Is disease for

Has breeding method
type: ObjectProperty
sub property of: Causative relationship
inverse of: Is breeding method of

Is breeding method of
type: ObjectProperty
sub property of: Causative relationship
inverse of: Has breeding method

Is output from
type: ObjectProperty
sub property of: Causative relationship
inverse of: Is input for

Is input for
type: ObjectProperty
sub property of: Causative relationship
inverse of: Is output from

Is prevented by
type: ObjectProperty
comment: X <est empêché par> Y. X peut être réduit, interrompu ou empêché par Y. Par exemple, "transmission des maladies" <est empêché par> "lavage des mains", "risque professionnel" <est empêché par> "sécurité du travail". @fr
comment: X <is prevented by> Y. X can be reduced, interrupted or prevented by Y. E.g. "disease transmission" <is prevented by> "hand hygiene", "occupational hazards" <is prevented by> "safety at work".
comment: X <se previene con> Y. X puede ser reducido, interrumpido o prevenido por Y. Ej. "Transmisión de enfermedades" <se previene con> "Higiene de manos", "Riesgos ocupacionales" <se previene con> "Seguridad en el trabajo". @es
comment: X <может быть предотвращен> Y. X может быть уменьшен, прерван или предотвращен Y. Например, "передача болезни" <может быть предотвращен> "мытье рук", "профессиональные риски" <может быть предотвращен> "безопасность труда". @ru
comment: X<由...防止>Y。X可通过Y来减少、中断或防止。例如：“疾病传播”<由...防止> “洗手”， “职业危害”<由...防止>“工作安全”。 @zh
comment: س <يُمنع من خلال> ع. يمكن تقليل س أو مقاطعته أو منعه بواسطة ع. على سبيل المثال: "نقل المرض" <يتم منعه من خلال> "نظافة اليدين"، "المخاطر المهنية" <يتم منعها بواسطة> "السلامة في العمل". @ar
label: Est empêché par @fr
label: Se previene con @es
label: может быть предотвращен @ru
label: تم منعه بواسطة @ar
label: 由...防止 @zh
sub property of: Causative relationship
inverse of: Prevents

Prevents
type: ObjectProperty
comment: Y <prevents> X. Y is an element which prevents, interrupts or reduces harm or damage X. E.g. “hand hygiene” <prevents> “disease transmission”, “safety at work”<prevents> “occupational hazards”.
comment: Y <previene> X. Y es un elemento que previene, interrumpe o reduce el daño o perjuicio X. Ej. “Higiene de manos" <previene> “Transmisión de enfermedades”, “Seguridad en el trabajo” <previene> “Riesgos ocupacionales”. @es
comment: Y <prévient> X. Y est un élément qui prévient, interrompt ou réduit les dommages ou dommages X. Par exemple, "lavage des mains" <prévient> "transmission des maladies", "sécurité du travail" <prévient> "risque professionnel". @fr
comment: Y <предотвращает> X. Y - это элемент, который предотвращает, прерывает или уменьшает вред или ущерб X. Например, "мытье рук" <предотвращает> "передача болезни", "безопасность труда" <предотвращает> "профессиональные риски". @ru
comment: Y<防止>X。Y可以防止、中断或减少伤害或损害X。例如：“洗手”<防止> “疾病传播”，“工作安全”<防止>“职业危害”。 @zh
comment: ع <يمنع> س. ع عنصر يمنع أو يقطع أو يقلل من الضرر أو الضرر س. على سبيل المثال: "نظافة اليدين" <تمنع> "نقل المرض"، "السلامة في العمل" <تمنع> "المخاطر المهنية". @ar
label: Previene @es
label: Prévient @fr
label: предотвращает @ru
label: يمنع @ar
label: 防止 @zh
sub property of: Causative relationship
inverse of: Is prevented by

Acts upon
type: ObjectProperty
sub property of: Causative relationship
inverse of: Is acted upon by

Is acted upon by
type: ObjectProperty
sub property of: Causative relationship
inverse of: Acts upon

Is natural enemy of
type: ObjectProperty
sub property of: Causative relationship
inverse of: Has natural enemy

Has natural enemy
type: ObjectProperty
sub property of: Causative relationship
inverse of: Is natural enemy of

Is abbreviation of
type: ObjectProperty
sub property of: Has synonym
inverse of: Has abbreviation

Smaller than
type: ObjectProperty
sub property of: Quantitative relationship
inverse of: Greater than

Greater than
type: ObjectProperty
sub property of: Quantitative relationship
inverse of: Smaller than

Is taxonomic rank of
type: ObjectProperty
comment: Y <es el rango taxonómico de> X. Describe el rango taxonómico Y del organismo X. Ej. "Especie (taxón)" <es el rango taxonómico de> "Spodoptera frugiperda". @es
comment: Y <is taxonomic rank of> X. Describes taxonomic rank Y of organism X. E.g. “species (taxa)” <is taxonomic rank of> “Spodoptera frugiperda”.
comment: Y<是...的分类等级>X。描述了生物体X的分类等级Y。例如：“物种(分类单位)”<是...的分类等级>“草地贪夜蛾”。 @zh
comment: Y <- таксономический ранг> X. Описывает таксономический ранг Y организма X. "вид (таксон)" <- таксономический ранг> "Spodoptera frugiperda". @ru
comment: Y <est le rang taxonomique de> X. Décrit le rang taxonomique Y de l'organisme X. "espèce (taxons)" <est le rang taxonomique de> "Spodoptera frugiperda". @fr
comment: ع <هي رتبة تصنيفية لـ> س. تصف المرتبة التصنيفية ع الكائن الحي س. على سبيل المثال: "الأنواع (نظام التصنيف)" <هي رتبة تصنيفية لـ> "Spodoptera frugiperda" @ar
domain: Concept
label: - таксономический ранг @ru
label: Es el rango taxonómico de @es
label: Est le rang taxonomique de @fr
label: هي رتبة تصنيفية @ar
label: 是...的分类等级 @zh
range: Concept
sub property of: Taxonomic relationship
inverse of: Has taxonomic rank

Taxonomic relationship
type: ObjectProperty
type: SymmetricProperty
comment: Super-property for taxonomic relationships.
comment: Super-propriété pour les relations taxonomiques @fr
comment: Superpropiedad para relaciones taxonómicas @es
comment: Суперсвойство для таксономических отношений @ru
comment: الملكية الفائقة للعلاقات التصنيفية @ar
comment: 所有分类学关系的父类属性 @zh
domain: Concept
label: Relaciones taxonómicas @es
label: Relations taxonomiques @fr
label: таксономические отношения @ru
label: العلاقات التصنيفية @ar
label: 分类学关系 @zh
range: Concept
sub property of: related

Has taxonomic rank
type: ObjectProperty
comment: X <a le rang taxonomique> Y. Décrit le rang taxonomique Y de l'organisme X. "Spodoptera frugiperda" <a le rang taxonomique> "espèce (taxon)" @fr
comment: X <has taxonomic rank> Y. Describes taxonomic rank Y of organism X. “Spodoptera frugiperda” <has taxonomic rank> “species (taxa)”.
comment: X <tiene el rango taxonómico> Y. Describe el rango taxonómico Y del organismo X. Ej. "Spodoptera frugiperda" <tiene el rango taxonómico> "Especie (taxón)". @es
comment: X <имеет таксономический ранг> Y. Описывает таксономический ранг Y организма X. "Spodoptera frugiperda" <имеет таксономический ранг> "вид (таксон)". @ru
comment: X<有分类等级>Y。描述了生物体X的分类等级Y。例如：“草地贪夜蛾”<有分类等级>“物种(分类单位)”。 @zh
comment: س <لها مرتبة تصنيفية في> ع. تصف المرتبة التصنيفية ع الكائن الحي س. على سبيل المثال: "Spodoptera frugiperda" <لها مرتبة تصنيفية في> "الأنواع (نظام التصنيف)". @ar
label: A le rang taxonomique @fr
label: Tiene el rango taxonómico @es
label: имеет таксономический ранг @ru
label: لديها المرتبة التصنيفية @ar
label: 有分类等级 @zh
sub property of: Taxonomic relationship
inverse of: Is taxonomic rank of

Has propagation material
type: ObjectProperty
sub property of: Causative relationship
inverse of: Is propagation material of

Is propagation material of
type: ObjectProperty
sub property of: Causative relationship
inverse of: Has propagation material

Type of
type: ObjectProperty
comment: Y <es tipo de> X. <es tipo te> es más amplio y bastante similar a <skos:broader>, pero no es exclusivo. Ej."Galope" <es tipo de> "Aires del caballo", pero también los elefantes y los camellos pueden galopar. @es
comment: Y <est un type de> X. Concept Y est un type de X. <est un type de> est plus large et assez similaire à <skos:broader>, mais il n'est pas exclusif. Par exemple, "galop" <est un type de> "allure de cheval", mais aussi les éléphants et les chameaux peuvent galoper. @fr
comment: Y <type of> X. Concept Y is a type of X. <type of> is broader and quite similar to <skos:broader>, but it is not exclusive. E.g. “gallop” <type of> “horse gaits”, but also elephants and camels can gallop.
comment: Y <является типом> X. Понятие Y является типом X. <является типом> шире и очень похоже на <skos:broader>, но не является исключительным. Например, "галопом" <является типом> "походки лошади", но также слоны и верблюды могут скакать галопом. @ru
comment: Y<是...的类型>X。概念Y是X的一种类型。<是...的类型>的范围更广，与<skos:broader>十分相似，但不具有排他性。例如：“驰骋”<是...的类型>“马的步态”，但大象和骆驼也可以驰骋。 @zh
comment: ع <هو نمط من > س. المفهوم ع هو نمط من س.<نمط من> أوسع ويشبه تمامًا <skos: أوسع> ، لكنه ليس حصريًا على سبيل المثال: "العدو السريع" <هو نمط من > "مشي الخيل"، ولكن أيضاً الفيلة والإبل يمكنها العدو السريع @ar
label: Es tipo de @es
label: Est un type de @fr
label: является типом @ru
label: هو نوع من @ar
label: 是...的类型 @zh
sub property of: Partitive relationship
inverse of: Has type

Has type
type: ObjectProperty
comment: El concepto X tiene tipos Y. <tiene tipo> es más amplio y bastante similar a <skos:broader>, pero no es exclusivo. Ej. "Aires del caballo" <tiene tipo> "Galope", pero también los elefantes y los camellos pueden galopar. @es
comment: X <a le type> Y. Le concept X a des types Y. <a le type> est plus large et assez similaire à <skos:broader>, mais il n'est pas exclusif. Par exemple, "allure de cheval" <a le type> "galop", mais aussi les éléphants et les chameaux peuvent galoper. @fr
comment: X <has type> Y. Concept X has types Y. <type of> is broader and quite similar to <skos:broader>, but it is not exclusive. E.g. “horse gaits” <has type> “gallop”, but also elephants and camels can gallop.
comment: X <имеет тип > Y. Понятие X имеет типы Y. <имеет тип> шире и очень похоже на <skos:broader>, но не является исключительным. Например, "походки лошади" <имеет тип> "галопом", но также слоны и верблюды могут скакать галопом. @ru
comment: X<有类型>Y。概念X有类型Y。<有类型>的范围更广，与<skos:broader>十分相似，但不具有排他性。例如：“马的步态”<有类型>“驰骋”，但大象和骆驼也可以驰骋。 @zh
comment: س <لديه النمط> ع. للمفهوم س الأنماط ع.<نمط من> أوسع ويشبه تمامًا <skos: أوسع> ، لكنه ليس حصريًا على سبيل المثال: "مشي الخيل" <لديها نمط> "العدو السريع"، ولكن أيضاً الفيلة والإبل يمكنها العدو السريع @ar
label: A le type @fr
label: Tiene tipo @es
label: имеет тип @ru
label: لديه نوع @ar
label: 有类型 @zh
sub property of: Partitive relationship
inverse of: Type of

Develops into
type: ObjectProperty
type: TransitiveProperty
sub property of: Temporal relations
inverse of: Develops from

Develops from
type: ObjectProperty
type: TransitiveProperty
domain: Concept
sub property of: Temporal relations
inverse of: Develops into

Is made from
type: ObjectProperty
comment: X <está hecho de> Y. El producto X se fabrica principalmente a partir de una sustancia o un producto Y. Ej. "Queso de oveja" <está hecho de> "Leche de oveja", "Hormigón" <está hecho de> "Cemento", "Tocino magro" <está hecho de> "Carne de cerdo". Elemento de procesamiento más fuerte que <es fuente de>. @es
comment: X <is made from> Y. Product X is mainly made from substance or a product Y. E.g. "sheep cheese" <is made from> "ewe milk", "concrete" <is made from> "cement", "bacon" <is made from> "pork". Stronger processing element than <is source of>.
comment: X <сделан из> Y. Продукт X в основном производится из вещества или продукта Y. Например, "овечий сыр" <сделан из> "овечье молоко", "бетон" <сделан из> "цемент", "бекон" <сделан из> "свинина". Более сильный элемент обработки, чем <сделан из>. @ru
comment: X<由...制成>Y。产品X主要由物质或产品Y制成。例如：“绵羊乳干酪”<由...制成> “绵羊奶”，“混凝土”<由...制成>“水泥”，“培根”<由...制成>“猪肉”。比<是...的来源>有更强的加工要素。 @zh
comment: X <est fait de> Y. Le produit X est principalement fabriqué à partir d'une substance ou d'un produit Y. Par exemple, "fromage de brebis" <est fait de> "lait de brebis", "béton" <est fait de> "ciment", "bacon" <est fait de> "viande porcine". Élément de traitement plus puissant que <est source de>. @fr
comment: س <مصنوع من> ع. المنتج س مصنوع بشكل أساسي من المادة أو المنتج ع. على سبيل المثال: "جبن الغنم" <مصنوع من> "حليب النعجة" "الخرسانة" <مصنوعة من> "الأسمنت" "لحم الخنزير المملح" <مصنوع من> "لحم الخنزير". عنصر معالجة أقوى من <هو مصدر> @ar
label: Est fait de @fr
label: Está hecho de @es
label: сделан из @ru
label: مصنوعه من @ar
label: 由...制成 @zh
sub property of: Causative relationship
inverse of: Is used to make

Is used to make
type: ObjectProperty
comment: Y <est utilisé pour fabriquer> X. Une substance ou un produit Y est utilisé pour fabriquer le produit X. Ex. "lait de brebis" <est utilisé pour fabriquer> "fromage de brebis", "ciment" <est utilisé pour fabriquer> "béton", "viande porcine" <est utilisé pour fabriquer> "bacon". Élément de traitement plus puissant que <est dérivé de>. @fr
comment: Y <is used to make> X. A substance or a product Y is used to make product X. E.g. "ewe milk" <is used to make> "sheep cheese", "cement" <is used to make> "concrete", "pork" <is used to make> "bacon". Stronger processing element than <is source of>.
comment: Y <se utiliza para hacer> X. Una sustancia o un producto Y se utiliza para fabricar el producto X. Ej. "Leche de oveja" <se utiliza para hacer> "Queso de oveja", "Cemento" <se utiliza para hacer> "Hormigón", "Carne de cerdo" <se utiliza para hacer> "Tocino magro". Elemento de procesamiento más fuerte que <es fuente de>. @es
comment: Y <используется для производства> X. Вещество или продукт Y используется для производства продукта X. Например, "овечье молоко" <используется для производства> "овечий сыр", "цемент" <используется для производства> "бетон", "свинина" <используется для производства> "бекон". Более сильный элемент обработки, чем <является источником>. @ru
comment: Y<用于制作> X。物质或产品Y用于制作产品X。例如：“绵羊奶”<用于制作> “绵羊乳干酪”，“水泥”<用于制作>“混凝土”，“猪肉”<用于制作> “培根”。比<是...的来源>有更强的加工要素。 @zh
comment: ع <يستخدم لصنع> س. المادة أو المنتج ع تستخدم لصنع المنتج س. على سبيل المثال: "حليب النعجة" <يستخدم لصنع> "جبن الغنم" "الاسمنت" <يستخدم لصنع> "الخرسانة" عنصر معالجة أقوى من <هو مصدر> @ar
label: Est utilisé pour fabriquer @fr
label: Se utiliza para hacer @es
label: используется для производства @ru
label: يستخدم لصنع @ar
label: 用于制作 @zh
sub property of: Causative relationship
inverse of: Is made from

Has member
type: ObjectProperty
comment: Y <a un membre> X. Un groupe social ou politique Y est constitué d'une ou plusieurs unités sociales ou politiques subsidiaires (groupe ou individu) X. Par exemple, "Afrique francophone" <a un membre> "Bénin", "colonie d'abeilles" <a un membre> "abeille ouvrière". Limiter l'utilisation aux unités géographiques/socio-politiques. Ne pas utiliser pour regrouper les organismes par utilisation, climat ou rang taxonomique. @fr
comment: Y <has member> X. A social or political group Y consists of one or more subsidiary social or political units (group or individual) X. E.g. "Francophone Africa" <has member> "Benin", "bee colonies" <has member> "worker bees". Limit use to geographical or socio-political units. Do not use for grouping organisms by use, climate, or taxonomic rank. Use <includes> / <included in> if describing spatial or temporal relation, if more loose than <has part/is part of>.
comment: Y <tiene miembro> X. Un grupo social o político Y se compone de una o más unidades sociales o políticas subsidiarias (grupo o individuo) X. Ej. "Africa de habla francesa" <tiene miembro> "Bénin", "Colonia de abejas" <tiene miembro> "Abejas obrera". Limitar el uso a unidades geográficas/sociopolíticas. No utilizar para agrupar organismos por uso, clima o rango taxonómico. @es
comment: Y <имеет члена> X. Социальная или политическая группа Y состоит из одной или более дочерних социальных или политических единиц (группы или индивида) X. Например, "франкоязычная Африка" <имеет члена> "Бенин", "челиные семьи" <имеет члена> "рабочие пчелы". Ограничьте использование географическими/социально-политическими единицами. Не используйте для группировки организмов по использованию, климату или таксономическому рангу. Используйте <включает/ входит в> при описании пространственных или временных отношений, если они более свободные, чем <имеет часть/является частью>. @ru
comment: Y <有成员>X。社会或政治团体Y由一个或多个附属的社会或政治单位（团体或个人）X组成。例如：“法语非洲”<有成员>“贝宁”，“蜜蜂群”<有成员>“工蜂”。限用于地理/社会政治单位。请勿用于按用途、气候或分类等级对生物体进行分组。对于空间或时间关系，使用<包含/包含于>，但比<有部分/是...的部分>更为松散。 @zh
comment: ع <لديه عضو> س. تتكون المجموعة الاجتماعية أو السياسية ع من وحدة اجتماعية أو سياسية فرعية واحدة أو أكثر (مجموعة أو فرد) س. على سبيل المثال: "أفريقيا الناطقة باللغة الفرنسية" <لديها العضو> بنن " مستعمرات النحل" <لديها العضو > "النحلات العاملات". قصر الاستخدام على الوحدات الجغرافية / الاجتماعية السياسية. لا تستخدم لتجميع الكائنات الحية حسب الاستخدام أو المناخ أو الترتيب التصنيفي. استخدم <تتضمن> / <مضمن في> إذا كنت تصف العلاقة المكانية أو الزمنية ، إذا كانت فضفاضة أكثر يستخدم <لها جزء / جزء من>. @ar
label: A un membre @fr
label: Tiene miembro @es
label: имеет члена @ru
label: لديه عضو @ar
label: 有成员 @zh
sub property of: Partitive relationship
inverse of: Is member of

Is member of
type: ObjectProperty
comment: X <es miembro de> Y. Una unidad social o política (grupo o individuo) X pertenece a un grupo social o político Y. Ej. "Benin" <es miembro de> "Africa de habla francesa", "Abejas obreras" <es miembro de> "Colonia de abejas". Limitar el uso a unidades geográficas/sociopolíticas. No utilizar para agrupar organismos por uso, clima o rango taxonómico. @es
comment: X <est membre de> Y: est membre de. Une unité sociale ou politique (groupe ou individu) X appartient à un groupe social ou politique Y. Par exemple, "Bénin" <est membre de> "Afrique francophone", "abeille ouvrière" <est membre de> "colonie d'abeilles". Limiter l'utilisation aux unités géographiques/socio-politiques, ne pas utiliser pour regrouper des organismes (par exemple, par utilisation, climat ou rang taxonomique). @fr
comment: X <is member of> Y. A social or political unit (group or individual) X belongs to a social or political group Y. E.g. "Benin" <is member of> "Francophone Africa", "worker bees" <is member of> "bee colonies". Limit use to geographical or socio-political units, do not use for grouping organisms (e.g. by use, climate, or taxonomic rank). Use <includes/included in> if describing spatial or temporal relation, but more loose than <is part of.>
comment: X <является членом> Y. Социальная или политическая единица (группа или индивид) X принадлежит к социальной или политической группе Y. Например, "бенин" <является членом> "франкоязычная африка", "рабочие пчелы" <является членом> "пчелиные семьи". Ограничьте использование географическими/социально-политическими единицами, не используйте для группировки организмов (например, по использованию, климату или таксономическому рангу). @ru
comment: X<是...的成员>Y。社会或政治单位（团体或个人）X属于社会或政治团体Y。例如：“贝宁”<是...的成员>“法语非洲”，“工蜂”<是...的成员>“蜜蜂群”。限用于地理/社会政治单位。请勿用于对生物体进行分组（如按用途、气候或分类等级）。对于空间或时间关系，使用<包含/包含于>，但比<有部分/是...的部分>更为松散。 @zh
comment: س <هو عضو في> ع. تنتمي الوحدة الاجتماعية أو السياسية (مجموعة أو فرد) س إلى مجموعة اجتماعية أو سياسية ع على سبيل المثال: "Benin" <هي عضو في> " إفريقيا الناطقة بالفرنسية" "النحلات العاملات" <هي عضو > "مستعمرات النحل". قصر الاستخدام على الوحدات الجغرافية / الاجتماعية السياسية. لا تستخدم لتجميع الكائنات الحية حسب الاستخدام أو المناخ أو الترتيب التصنيفي. استخدم <تتضمن> / <مضمن في> إذا كنت تصف العلاقة المكانية أو الزمنية ، إذا كانت فضفاضة أكثر يستخدم <جزء من>. @ar
label: Es miembro de @es
label: Est membre de @fr
label: является членом @ru
label: هو عضو في @ar
label: 是...的成员 @zh
sub property of: Partitive relationship
inverse of: Has member

Has vector or host
type: ObjectProperty
comment: X <a le vecteur ou l'hôte> Y. X a un organisme hôte ou un vecteur Y. Par exemple, "Plasmodium" <A le vecteur ou l'hôte> "Anopheles". @fr
comment: X <has vector or host> Y. X has organism host or vector Y. E.g. “Plasmodium” <has host> ”Anopheles”.
comment: X <tiene huesped u vector> Y. X tiene el organismo huésped o vector Y. Ej. “Plasmodium” <tiene huesped u vector> ”Anopheles”. @es
comment: X <имеет вектор или хост> Y. X имеет организм-хозяина или вектор Y. Например, "Plasmodium" <имеет вектор или хост> "Anopheles". @ru
comment: X<有寄主>Y。X有生物寄主或传播媒介Y。例如：“疟原虫属”<有寄主>“按蚊属” 。 @zh
comment: س <لديه ناقل أو مضيف> ع. س لديه الكائن الحي الناقل أو المضيف ع. على سبيل المثال: "المتصورة" <لديها المضيف> "بعوضة الملاريا". @ar
label: A le vecteur ou l'hôte @fr
label: Tiene huésped u vector @es
label: Имеет вектор или хост @ru
label: لديه مضيف @ar
label: 有寄主 @zh
sub property of: Causative relationship
inverse of: Is vector or host for

Is vector or host for
type: ObjectProperty
comment: Y <Is vector or host for> X. Organism Y is host or vector for X. E.g. “Anopheles” <is vector or host for> ”Plasmodium”.
comment: Y <possède un vecteur ou est hôte de> X. L'organisme Y est l'hôte ou le vecteur de X. Par exemple, "Anophele" <possède un vecteur ou est hôte de> "Plasmodium". @fr
comment: Y <tiene vector o es huésped de> X. El organismo Y es huésped o vector de Y. Ej. “Anopheles” <tiene vector o es huésped de> ”Plasmodium”. @es
comment: Y <вектор или хост для> X. Организм Y является хозяином или переносчиком для X. "Anopheles" <вектор или хост для> "Plasmodium". @ru
comment: Y<是...的寄主>X。生物体Y是X的寄主或传播媒介。例如：“按蚊属”<是...的寄主>“疟原虫属” 。 @zh
comment: ع <هو الناقل أو المضيف لـ > س. الكائن الحي ع هو ميف أو ناقل لـ س. على سبيل المثال: "بعوضة الملاريا" <هي الناقل أو المضيف لـ> "المتصورة". @ar
label: Es vector o es huésped de @es
label: Est vecteur ou est hôte de @fr
label: Является вектором или хостом для @ru
label: مضيف لـ @ar
label: 是...的寄主 @zh
sub property of: Causative relationship
inverse of: Has vector or host

Is spatially included in
type: ObjectProperty
comment: Y <est spatialement inclus dans> X. La région Y est une partie spatiale inaliénable de la région spatiale X. Par exemple, "eaux continentales africaines" <est spatialement inclus dans> "Afrique", "Pérou" <est spatialement inclus dans> "région andine". @fr
comment: Y <is spatially included in> X. Spatial region Y is an inalienable spatial part of spatial region X. E.g. "African inland waters" <is spatially included in> "Africa", "Peru" <is spatially included in> "Andean region".
comment: Y <se incluye espacialmente en> X. La región Y es una parte espacial inalienable de la región espacial X. Ej. "Aguas interiores de África" <se incluye espacialmente en> "África", "Perú" <se incluye espacialmente en> "Región andina". @es
comment: Y <пространственно включен в> X. Пространственная область Y является неотъемлемой пространственной частью пространственной области X. Например, "внутренние воды Африки" <пространственно включен в> "Африка", "Перу" <пространственно включен в> "Андский регион". @ru
comment: Y<空间包含于>X。空间区域Y是空间区域X不可分割的空间部分。例如：“非洲大陆水体”<空间包含于>“非洲”，“秘鲁”<空间包含于>“安第斯山脉地区”。 @zh
comment: ع <مُدرج مكانياً في> س. المنطقة المكانية ع هي جزء مكاني غير قابل للتصرف من المنطقة المكانية س. على سبيل المثال: "المياه الداخلية الإفريقية" <مدرجة مكانيًا في> "إفريقيا" ، و "البيرو" <مدرجة مكانيًا في> "منطقة الأنديز". @ar
domain: Concept
label: Est spatialement inclus dans @fr
label: Se incluye espacialmente en @es
label: пространственно включен в @ru
label: مدرج مكانيًا في @ar
label: 空间包含于 @zh
sub property of: Spatial relationship
inverse of: Spatially includes

Spatially includes
type: ObjectProperty
comment: X <incluye espacialmente> Y. La parte X es una parte inalienable de Y (la región espacial ocupada por Y es una parte de la región espacial ocupada por X). Ej. "África" <incluye espacialmente> "Aguas interiores de África", "Región andina" <incluye espacialmente> "Perú". @es
comment: X <spatialement inclut> Y. La région X comprend spatialement comme partie inaliénable la région spatiale Y. Par exemple, "Afrique" <spatialement inclu> "eaux continentales africaines", "région andine" <spatialement inclu> "Pérou". @fr
comment: X <spatially includes> Y. Region X spatially includes as inalienable part the spatial region Y. E.g. "Africa" <spatially includes> "African inland waters", "Andean region" <spatially includes> "Peru".
comment: X <пространственно включает> Y. Регион X пространственно включает в качестве неотъемлемой части пространственный регион Y. Например, "Африка" <пространственно включает> "внутренние воды Африки", "Андский регион" <пространственно включает> "Перу". @ru
comment: X<空间包含>Y。区域X在空间上包含空间区域Y ，作为其不可分割的一部分。例如：“非洲”<空间包含>“非洲大陆水体”，“安第斯山脉地区”<空间包含>“秘鲁”。 @zh
comment: س <يشمل مكانياً > ع. تتضمن المنطقة س مكانيًا كجزء غير قابل للتصرف المنطقة المكانية ع على سبيل المثال: "إفريقيا" <تشمل مكانياً> "المياه الداخلية الإفريقية" ، و "منطقة الأنديز" <تشمل مكانيًا> "البيرو". @ar
label: Incluye espacialmente @es
label: Spatialement inclut @fr
label: x مكانيًا يشمل y @ar
label: пространственно включает @ru
label: 空间包含 @zh
sub property of: Spatial relationship
inverse of: Is spatially included in

Formerly included in
type: ObjectProperty
comment: An inclusion that was valid in the past but currently is not valid anymore.
sub property of: Is included in
inverse of: Formerly includes

Formerly includes
type: ObjectProperty
sub property of: Includes
inverse of: Formerly included in

Is derived from
type: ObjectProperty
comment: X <es derivado de> Y. Una sustancia o producto X obtenido exclusivamente de la fuente Y sin ninguna sustancia o producto adicional. Ej. “Aceite de almendra” <es derivado de> “Almendra”, “Zumo de naranja” <es derivado de> “Naranja dulce”. Se utiliza para relacionar un organismo con un producto derivado: “Carne de carnero” <es derivado de> “Ovinos”. @es
comment: X <est dérivé de> Y. Une substance ou un produit X obtenu exclusivement à partir de la source Y sans aucune substance ou produit supplémentaire. Par exemple, "huile d'amande" <est dérivé de> "amande", "jus d'orange" <est dérivé de> "orange douce". À utiliser pour relier un organisme à un produit dérivé "viande ovine" <est dérivé de> "ovin". @fr
comment: X <is derived from> Y. A substance or product X obtained exclusively from source Y without any additional substance or product. E.g. “almond oil” <is derived from> “almonds”, “orange juice” <is derived from> “sweet oranges”. Use to relate an organism with a derived product: “mutton” <is derived from> “sheep”.
comment: X <получен из> Y. Вещество или продукт X, полученный исключительно из источника Y без каких-либо дополнительных веществ или продуктов. Например, "миндальное масло" <получен из> "миндаль (орехи)", "апельсиновый сок" <получен из> "сладкие апельсины". Используется, чтобы показать связь между организмом и производным продуктом: "баранина" <получен из> "овцы". @ru
comment: X<源自>Y。物质或产品X的获得完全源自Y，不含额外的物质或产品。例如：“杏仁油”<源自>“杏仁”，“橙汁”<源自>“甜橙”。用于表示生物体及其衍生产品的关系：“羊肉”<源自>“绵羊”。 @zh
comment: س <مشتق من> ع. يتم الحصول على المادة و المنتج س حصريً من المصدر ع وبدون أي مادة أو منتج إضافي. على سبيل المثال: " زيت اللوز" <مشتق من> " اللوز" "عصير البرتقال" <مشتق من> " البرتقال الحلو". تستخدم لربط كائن حي بمنتج مشتق: "لحم الضأن" <مشتق من> "الخروف". @ar
label: Es derivado de @es
label: Est dérivé de @fr
label: получен из @ru
label: مشتق من @ar
label: 源自 @zh
sub property of: Causative relationship
inverse of: Is source of

Is source of
type: ObjectProperty
comment: Y <es fuente de> X. E.g. “Almendra" <es fuente de> “Aceite de almendra", “Naranja dulce” <es fuente de> “Zumo de naranja". Se utiliza para relacionar un organismo con un producto derivado: “Ovinos” <es fuente de> “Carne de carnero”. (Pero “Miel” <es producido por> “Abeja melífera”, “Efluentes del ensilaje” <producto de> “Ensilado”.) @es
comment: Y <est source de> X. Ex. "amande" <est source de> "huile d'amande", "oranges douce" <est source de> "jus d'orange". Utiliser pour relier un organisme à un produit dérivé : "ovin" <est source de> "viande ovine". (Mais "miel" <est produit par> "abeille domestique", "effluent d'ensilage" <est le produit de> "ensilage (produit)".) @fr
comment: Y <is source of> X. E.g. “almonds" <is source of> “almond oil”, “sweet oranges”<is source of> “orange juice". Use to relate an organism with a derived product: “sheep” <is source of> “mutton”. (But “honey” <is produced by> “honey bees”, “silage effluents” <product of> “silage”.)
comment: Y <является источником> X. Например, "миндаль (орехи)" <является источником> "миндальное масло", "апельсины" <является источником> "апельсиновый сок". Используется, чтобы показать связь между организмом и производным продуктом: "овцы" <является источником> "баранина". (Однако "мед" <производится> "медоносные пчелы", " силосные стоки" <является продуктом> "силос"). @ru
comment: Y<是...的来源>X。例如：“杏仁”<是...的来源>“杏仁油”，“甜橙”<是...的来源>“橙汁”。用于表示生物体及其衍生产品的关系：“绵羊”<是...的来源>“羊肉”。（但是，“蜂蜜”<由...生产> “蜜蜂”，“青贮料渗出液”<是...的产品>“青贮饲料”。） @zh
comment: ع <هو مصدر> س. على سبيل المثال: " اللوز" <هو مصدر> "زيت اللوز" "البرتقال الحلو" <هو مصدر> " عصير البرتقال" تستخدم لربط كائن حي بمنتج مشتق: "الخروف" <هو مصدر> "لحم الضأن" (لكن العسل <يتم إنتاجه من قبل> "نحل العسل"، "مخلفات العلف المخزون" <هي نتاج> " العلف المخزون") @ar
label: Es fuente de @es
label: Est source de @fr
label: является источником @ru
label: هو مصدر @ar
label: 是...的来源 @zh
sub property of: Causative relationship
inverse of: Is derived from

Is weed of
type: ObjectProperty
sub property of: Causative relationship
inverse of: Has weed

Has weed
type: ObjectProperty
sub property of: Causative relationship
inverse of: Is weed of

Has product
type: ObjectProperty
comment: X <a le produit> Y. X est la source du produit Y, avec un élément de traitement. Par exemple: "exploitation forestière" <a le produit> "déchet d'exploitation forestière", "Espagne" <a le produit> "xérès". @fr
comment: X <has product> Y. X is the source of product Y, with a processing element. E.g. “logging”<has product> “logging wastes”, “Spain” <has product> “sherry”.
comment: X <tiene el producto> Y. X es la fuente del producto Y, con un elemento de procesamiento. Ej. “Aprovechamiento de la madera” <tiene el producto> “Residuos de explotación forestal”, “España” <tiene el producto> “Jerez”. @es
comment: X <имеет продукт> Y. X является источником продукта Y, с элементом переработки. Например, "лесозаготовки" <имеет продукт> "отходы лесозаготовки", "Испания" <имеет продукт> "херес". @ru
comment: X<有产品>Y。X是产品Y的来源，其中有加工处理的要素。例如：“森林采运”<有产品>“砍伐损失”，“ 西班牙”<有产品>“雪利酒”。 @zh
comment: س <لديه المنتج> ع. س هو مصدر المنتج ع مع عنصر معالجة. على سبيل المثال: "قطع الجذور" <لديه المنتج> "نفايات قطع الأخشاب" اسبانيا <لديها المنتج> الخمر شيري @ar
label: A le produit @fr
label: Tiene el producto @es
label: имеет продукт @ru
label: لديه المنتج @ar
label: 有产品 @zh
sub property of: Causative relationship
inverse of: Product of

Product of
type: ObjectProperty
comment: Y <est le produit de> X, avec un élément de traitement. Y est produit ou fabriqué à la suite de X. Par exemple, "déchet d'exploitation forestière" <est le produit de> "exploitation forestière", "xérès" <est le produit de> "Espagne". Cependant, "miel" <est produit par> "abeille domestique". @fr
comment: Y <product of> X, with a processing element. Y is produced or manufactured as a result or consequence of X. E.g. “logging wastes” <product of> “logging”, “sherry” <product of> “Spain”. However, “honey” <is produced by> “honey bees”.
comment: Y <producto de> X, con un elemento de transformación. Y se produce o fabrica como resultado o consecuencia de X. Ej. “Residuos de explotación forestal” <producto de> “Aprovechamiento de la madera”, “Jerez” <producto de> “España”. Pero, “Miel” <es producido por> “Abeja melífera”. @es
comment: Y является продуктом X, Y <является продуктом> X, с элементом обработки. Y производится или изготавливается как результат или следствие X. Например, "отходы лесозаготовки" <является продуктом> "лесозаготовки", "херес" <является продуктом> "Испания". Однако "мед" <производится> "медоносные пчелы". @ru
comment: Y<是...的产品>X，其中有加工处理的要素。Y的生产或制造是X的结果或后果。例如：“砍伐损失”<是...的产品>“森林采运”，“雪利酒”<是...的产品>“ 西班牙”。但是，“蜂蜜” <由...生产>“蜜蜂”。 @zh
comment: ع <هو نتاج> س مع عنصر معالجة. ع يتم إنتاجها أو تصنيعها كنتيجة أو عاقبة لـ س. على سبيل المثال: "نفايات قطع الأخشاب" <هو نتاج> "قطع الجذور" "الخمر شيري" <هو نتاج> "اسبانيا" "العسل" <هو نتاج> "نحل العسل" @ar
label: Est le produit de @fr
label: Producto de @es
label: является продуктом @ru
label: هو نتاج @ar
label: 是...的产品 @zh
sub property of: Causative relationship
inverse of: Has product

Is post-production practice for
type: ObjectProperty
sub property of: Is practice for
inverse of: Has post-production practice

Has post-production practice
type: ObjectProperty
sub property of: Has practice
inverse of: Is post-production practice for

Using value
type: ObjectProperty
comment: A concept that make use of a specific value.
sub property of: Quantitative relationship
inverse of: Value used in

Value used in
type: ObjectProperty
comment: A measure or other value used in a specific activity or methods or for any purpose.
sub property of: Quantitative relationship
inverse of: Using value

Has disorder
type: ObjectProperty
sub property of: Causative relationship
inverse of: Is disorder of

Is disorder of
type: ObjectProperty
sub property of: Causative relationship
inverse of: Has disorder

Has plural
type: DatatypeProperty
domain: Label

Has spelling variant
type: ObjectProperty
type: SymmetricProperty
sub property of: Has synonym

Has FAO term code
type: DatatypeProperty
type: FunctionalProperty
domain: Label
range: string
sub property of: notation

Has code in the schema FAO Priority Area
type: DatatypeProperty
type: FunctionalProperty
domain: Label
range: string
sub property of: notation

Is spatially included in city
type: DatatypeProperty
type: FunctionalProperty
domain: Concept
range: string

Has singular
type: DatatypeProperty
domain: Label

Has ASFA code
type: DatatypeProperty
type: FunctionalProperty
domain: Label
range: string
sub property of: notation

Has ASC code
type: DatatypeProperty
type: FunctionalProperty
domain: Label
range: string
sub property of: notation

Has variety
type: ObjectProperty
type: SymmetricProperty
comment: Simmetric relationship indicating that two concepts are variety each other.
sub property of: Taxonomic relationship

Has near synonym
type: ObjectProperty
type: SymmetricProperty
sub property of: Has synonym

Has antonym or Has opposite
type: ObjectProperty
type: SymmetricProperty
sub property of: related

Has ISO 3 country code
type: DatatypeProperty
type: FunctionalProperty
comment: La Norme internationale des codes des noms de pays et de leurs subdivisions. Code alpha-3 – code à trois lettres utilisé pour la représentation des noms de pays, permettant une association visuelle avec le nom usuel du pays. @fr
comment: La norma internacional para los códigos de nombres de países y sus subdivisiones. Código Alfa-3: código de tres letras utilizado para la representación de nombres de países, que permite la asociación visual con el nombre común del país. @es
comment: The International Standard for country codes and codes for their subdivisions. Alpha-3 code – a three-letter code that represents a country name, which is usually more closely related to the country name
comment: ИСО 3166 является международным стандартом для представления названий стран и единиц их административно-территориального деления. @ru
comment: المعيار الدولي لرموز الدول ورموز التقسيمات الفرعية الخاصة بهم. رمز Alpha-3 - رمز مكون من ثلاثة أحرف يمثل اسم البلد ، والذي يكون عادةً أكثر ارتباطًا باسم البلد @ar
comment: 国家代码及其分区代码的国际标准。Alpha-3代码是代表国家名称的三位字母代码，通常更接近于国家名称。 @zh
domain: Concept
label: A le code pays ISO3 @fr
label: Tiene código ISO3 de país @es
label: Имеет код страны ISO3 @ru
label: لديه رمز البلد ISO3 @ar
label: 有ISO3国家码 @zh
range: string
sub property of: notation

Has fishery 3 alpha code
type: DatatypeProperty
type: FunctionalProperty
domain: Label
range: string
sub property of: notation

Is part of subvocabulary
type: DatatypeProperty
domain: Concept
range: RangeOfIsPartOfSubvocabulary

Has term type
type: DatatypeProperty
type: FunctionalProperty
domain: Label
range: RangeOfHasTermType

Is spatially included in state
type: DatatypeProperty
type: FunctionalProperty
domain: Concept
range: string

Has taxonomic code
type: DatatypeProperty
type: FunctionalProperty
domain: Label
range: string
sub property of: notation

M49 code
type: DatatypeProperty
comment: UN M49 أو معيار البلد أو رموز المنطقة للاستخدام الإحصائي (السلسلة M، رقم 49) هو معيار لرموز المنطقة التي تستخدمها الأمم المتحدة للأغراض الإحصائية وتطويرها والتي تحتفظ بها شعبة الإحصاءات في الأمم المتحدة. @ar
comment: UN M49 o Códigos de país o área estándar para fines estadísticos (serie M, nº 49) es un estándar para los códigos de área utilizados por las Naciones Unidas con fines estadísticos, desarrollado y mantenido por la División de Estadística de las Naciones Unidas. @es
comment: UN M49 or the Standard Country or Area Codes for Statistical Use (Series M, No. 49) is a standard for area codes used by the United Nations for statistical purposes, developed and maintained by the United Nations Statistics Division.
comment: UN M49 ou les codes de pays ou de zone standard à usage statistique (série M, n ° 49) est une norme pour les codes de zone utilisés par les Nations Unies à des fins statistiques, développée et maintenue par la Division de statistique des Nations Unies. @fr
comment: Стандарт ООН M.49 (англ. UN M.49) — стандарт для кодов регионов, используемый ООН для статистических целей, разработанный и поддерживаемый Статистическим отделом ООН. @ru
comment: 联合国M49，即统计用标准国家或地区代码（M系列，第49号）是联合国用于统计目的的地区代码标准，由联合国统计司制定和维护。 @zh
domain: Concept
label: Code M49 @fr
label: Código M49 @es
label: M.49 @ru
label: M49码 @zh
label: UN M49 @ar
range: string
sub property of: notation

RangeOfIsPartOfSubvocabulary
type: Datatype
equivalent class: Datatype
  one of: Chemicals
  one of: Geographical country level
  one of: Geographical above country level
  one of: Geographical below country level
  one of: Fishery related term
  one of: Land Vocabulary

RangeOfHasTermType
type: Datatype
equivalent class: Datatype
  one of: Acronym
  one of: Common name for animals
  one of: Common name for bacteria
  one of: Common name for fungi
  one of: Common name for plants
  one of: Common name for viruses
  one of: Taxonomic terms for animals
  one of: Taxonomic terms for bacteria
  one of: Taxonomic terms for fungi
  one of: Taxonomic terms for plants
  one of: Taxonomic terms for viruses

Has common name concept
type: ObjectProperty
comment: Y <a nom commun de concept> X. Y est un concept scientifiquement défini pour un organisme ou un groupe d'organismes avec des noms scientifiques comme terme, ayant un rang taxonomique spécifique. "Apis mellifera" <a nom commun de concept> "abeille domestique". Utilisation au niveau du concept lorsque le nom commun et le nom scientifique sont des concepts distincts. Pour une relation terme à terme à utiliser dans un concept, utilisez <a nom scientifique/ est le nom scientifique>. @fr
comment: Y <has common name concept> X. Y is a scientifically defined concept for an organism or a group of organisms with scientific name as labels, having a specific taxonomic rank. "Apis mellifera” <has common name concept> “honey bees”. Use at concept level when common name and scientific name are separate concepts. For label-to-label relationship for use within a concept, use <has scientific name / scientific name of>.
comment: Y <tiene nombre común del concepto> X. Y es un concepto definido científicamente para un organismo o un grupo de organismos con nombre científico como etiquetas, que tiene un rango taxonómico específico. "Apis mellifera" <tiene nombre común del concepto> "Abeja melífera". Se utiliza a nivel de concepto cuando el nombre común y el nombre científico son conceptos separados. Para la relación de etiqueta a etiqueta para su uso dentro de un concepto, utilice <tiene nombre científico / es el nombre científico de>. @es
comment: Y <имеет концепцию общего названия> X. Y - это научно определенное понятие для организма или группы организмов с научным названием в качестве метки, имеющих определенный таксономический ранг. "Apis mellifera" <имеет концепцию общего названия> "медоносные пчелы". Используется на уровне концепции, когда общее название и научное название являются отдельными концепциями. Для связи между метками для использования внутри концепции используйте <имеет научное название / - научное имя>. @ru
comment: Y<有常用名概念>X。Y是某一生物体或生物群X的学名概念，其标签为学名，具有特定的分类等级。“Apis mellifera”<有常用名概念>“蜜蜂”。当常用名和学名是独立的概念时，在概念层面使用。对于标签间关系，在同一个概念内使用<有学名/是...的学名>。 @zh
comment: ع <لها مفهوم الاسم الشائع> س. ع هو مفهوم محدد علميًا لكائن حي أو مجموعة من الكائنات الحية التي تحمل اسمًا علميًا كعلامات ، ولها رتبة تصنيفية محددة على سبيل المثال"Apis mellifera". <لها مفهوم الاسم الشائع> "نحل العسل". يستخدم على مستوى المفهوم عندما يكون الاسم الشائع والاسم العلمي مفهومين منفصلين. لعلاقة التسمية إلى التسمية للاستخدام ضمن المفهوم ، استخدم <له اسم علمي / اسم علمي لـ>. @ar
domain: Concept
label: A nom commun de concept @fr
label: Tiene nombre común del concepto @es
label: имеет концепцию общего названия @ru
label: له مفهوم الاسم الشائع @ar
label: 有常用名概念 @zh
range: Concept
sub property of: Taxonomic relationship
inverse of: Has taxonomic concept

Has taxonomic concept
type: ObjectProperty
comment: X <a concept taxonomique> Y. X est un concept de nom commun pour un organisme ou un groupe d'organismes. Y est le nom de concept scientifiquement défini pour le même organisme ou un groupe d'organismes, ayant un rang taxonomique spécifique. Par exemple, "abeille domestique" <a concept taxonomique> "Apis mellifera". À utiliser au niveau du concept lorsque le nom commun et le nom scientifique sont des concepts distincts. Pour une relation terme à terme à utiliser dans un concept, utilisez <a nom scientifique/ est le nom scientifique>. @fr
comment: X <has taxonomic concept> Y. X is a common name concept for an organism or organism group. Y is the scientifically defined concept name for the same organism or a group of organisms, having a specific taxonomic rank. E.g. “honey bees” <has taxonomic concept> ”Apis mellifera”. Use at concept level when common name and scientific name are separate concepts. For label-to-label relationship for use within a concept, use <has scientific name / scientific name of>.
comment: X <tiene concepto taxonómico> Y. X es un concepto de nombre común para un organismo o grupo de organismos. Y es el nombre conceptual definido científicamente para el mismo organismo o grupo de organismos, que tiene un rango taxonómico específico. Por ejemplo, "Abeja melífera" <tiene concepto taxonómico> "Apis mellifera". Se utiliza a nivel de concepto cuando el nombre común y el nombre científico son conceptos separados. Para la relación de etiqueta a etiqueta para su uso dentro de un concepto, utilice <tiene nombre científico / es el nombre científico de>. @es
comment: X <имеет таксономическую концепцию> Y. X - это общее понятие названия для организма или группы организмов. Y - это научно определенное концептуальное название того же организма или группы организмов, имеющее определенный таксономический ранг. Например, "медоносные пчелы" <имеет таксономическую концепцию> "Apis mellifera". Используется на уровне концепции, когда общее название и научное название являются отдельными концепциями. Для связи между метками для использования внутри концепции, используйте <имеет научное название / - научное имя>. @ru
comment: X<有分类学概念>Y。X是某一生物体或生物体组别的常用名概念。Y是同一生物体或生物群的学名概念，有特定的分类等级。 例如：“蜜蜂”<有分类学概念>“Apis mellifera”。当常用名和学名是独立的概念时，在概念层面使用。对于标签间关系，在同一个概念内使用<有学名/是...的学名>。 @zh
comment: س <لها مفهوم تصنيفي> ع. س هو مفهوم الاسم الشائع لكائن أو مجموعة الكائن. ع هو اسم المفهوم المحدد علمياً لنفس الكائن الحي أو لمجموعة من الكائنات ، لها رتبة تصنيفية محددة. على سبيل المثال "نحل العسل" <له مفهوم التصنيف> "Apis mellifera". يستخدم على مستوى المفهوم عندما يكون الاسم الشائع والاسم العلمي مفهومين منفصلين. لعلاقة التسمية إلى التسمية للاستخدام ضمن المفهوم ، استخدم <له اسم علمي / اسم علمي لـ>. @ar
domain: Concept
label: A concept taxonomique @fr
label: Tiene concepto taxonómico @es
label: имеет таксономическую концепцию @ru
label: مفهوم التصنيف @ar
label: 有分类学概念 @zh
range: Concept
sub property of: Taxonomic relationship
inverse of: Has common name concept

Spatial relationship
type: ObjectProperty
type: SymmetricProperty
comment: Super-property for spatial relationships
comment: Super-propriété pour les relations spatiales @fr
comment: Superpropiedad de las relaciones espaciales @es
comment: Сверхсвойство для пространственных отношений @ru
comment: خاصية فائقة للعلاقات المكانية @ar
comment: 所有空间关系的父类属性 @zh
domain: Concept
label: Relaciones espaciales @es
label: Relations spatiales @fr
label: пространственные отношения @ru
label: العلاقات المكانية @ar
label: 空间关系 @zh
range: Concept
sub property of: related

Process relationships
type: ObjectProperty
type: SymmetricProperty
comment: Super-property for process relationships
comment: Super-propriété pour les relations de processus @fr
comment: Superpropiedad para relaciones de procesos @es
comment: процессные отношения @ru
comment: خاصية فائقة لعلاقات العملية @ar
comment: 所有过程关系的父类属性 @zh
domain: Concept
label: Relaciones de procesos @es
label: Relations de processus @fr
label: процессные отношения @ru
label: علاقات العملية @ar
label: 过程关系 @zh
range: Concept
sub property of: related

Partitive relationship
type: ObjectProperty
type: SymmetricProperty
comment: Super-property for partitive relationships
comment: Super-propriété pour les relations partitives @fr
comment: Superpropiedad de las relaciones partitivas @es
comment: Суперсвойство для партитивных отношений @ru
comment: خاصية فائقة للعلاقات الجزئية @ar
comment: 所有整体部分关系的父类属性 @zh
domain: Concept
label: Relaciones partitivas @es
label: Relations partitives @fr
label: партитивные отношения @ru
label: العلاقات الجزئية @ar
label: 整体部分关系 @zh
range: Concept
sub property of: related